关于vs生成app错误提示,提醒Execution failed for task ':transformClassesWithDexForDebug'.
昨天将vs和android SDK更新之后生成app之后发现app生成出错,报错如下:
FAILURE: Build failed with an exception.
* What went wrong:
Execution failed for task ':transformClassesWithDexForDebug'.
> com.android.build.api.transform.TransformException: java.lang.RuntimeException: com.android.ide.common.process.ProcessException: java.util.concurrent.ExecutionException: com.android.ide.common.process.ProcessException: org.gradle.process.internal.ExecException: Process 'command 'C:\Program Files (x86)\Java\jdk1.7.0_55\bin\java.exe'' finished with non-zero exit value 1
* Try:
Run with --stacktrace option to get the stack trace. Run with --info or --debug option to get more log output.
java.lang.UnsupportedClassVersionError: com/android/dx/command/Main : Unsupported major.minor version 52.0
at java.lang.ClassLoader.defineClass1(Native Method)
at java.lang.ClassLoader.defineClass(ClassLoader.java:800)
at java.security.SecureClassLoader.defineClass(SecureClassLoader.java:142)
at java.net.URLClassLoader.defineClass(URLClassLoader.java:449)
at java.net.URLClassLoader.access$100(URLClassLoader.java:71)
at java.net.URLClassLoader$1.run(URLClassLoader.java:361)
at java.net.URLClassLoader$1.run(URLClassLoader.java:355)
at java.security.AccessController.doPrivileged(Native Method)
at java.net.URLClassLoader.findClass(URLClassLoader.java:354)
at java.lang.ClassLoader.loadClass(ClassLoader.java:425)
at sun.misc.Launcher$AppClassLoader.loadClass(Launcher.java:308)
at java.lang.ClassLoader.loadClass(ClassLoader.java:358)
at sun.launcher.LauncherHelper.checkAndLoadMain(LauncherHelper.java:482)
Exception in thread "main"
Error: cmd: Command failed with exit code 1 Error output:
java.lang.UnsupportedClassVersionError: com/android/dx/command/Main : Unsupported major.minor version 52.0
at java.lang.ClassLoader.defineClass1(Native Method)
at java.lang.ClassLoader.defineClass(ClassLoader.java:800)
at java.security.SecureClassLoader.defineClass(SecureClassLoader.java:142)
at java.net.URLClassLoader.defineClass(URLClassLoader.java:449)
at java.net.URLClassLoader.access$100(URLClassLoader.java:71)
at java.net.URLClassLoader$1.run(URLClassLoader.java:361)
at java.net.URLClassLoader$1.run(URLClassLoader.java:355)
at java.security.AccessController.doPrivileged(Native Method)
at java.net.URLClassLoader.findClass(URLClassLoader.java:354)
at java.lang.ClassLoader.loadClass(ClassLoader.java:425)
at sun.misc.Launcher$AppClassLoader.loadClass(Launcher.java:308)
at java.lang.ClassLoader.loadClass(ClassLoader.java:358)
at sun.launcher.LauncherHelper.checkAndLoadMain(LauncherHelper.java:482)
Picked up _JAVA_OPTIONS: -Xmx512M
Exception in thread "main"
FAILURE: Build failed with an exception.
* What went wrong:
Execution failed for task ':transformClassesWithDexForDebug'.
> com.android.build.api.transform.TransformException: java.lang.RuntimeException: com.android.ide.common.process.ProcessException: java.util.concurrent.ExecutionException: com.android.ide.common.process.ProcessException: org.gradle.process.internal.ExecException: Process 'command 'C:\Program Files (x86)\Java\jdk1.7.0_55\bin\java.exe'' finished with non-zero exit value 1
* Try:
Run with --stacktrace option to get the stack trace. Run with --info or --debug option to get more log output.
java.lang.UnsupportedClassVersionError: com/android/dx/command/Main : Unsupported major.minor version 52.0
at java.lang.ClassLoader.defineClass1(Native Method)
at java.lang.ClassLoader.defineClass(ClassLoader.java:800)
at java.security.SecureClassLoader.defineClass(SecureClassLoader.java:142)
at java.net.URLClassLoader.defineClass(URLClassLoader.java:449)
at java.net.URLClassLoader.access$100(URLClassLoader.java:71)
at java.net.URLClassLoader$1.run(URLClassLoader.java:361)
at java.net.URLClassLoader$1.run(URLClassLoader.java:355)
at java.security.AccessController.doPrivileged(Native Method)
at java.net.URLClassLoader.findClass(URLClassLoader.java:354)
at java.lang.ClassLoader.loadClass(ClassLoader.java:425)
at sun.misc.Launcher$AppClassLoader.loadClass(Launcher.java:308)
at java.lang.ClassLoader.loadClass(ClassLoader.java:358)
at sun.launcher.LauncherHelper.checkAndLoadMain(LauncherHelper.java:482)
Picked up _JAVA_OPTIONS: -Xmx512M
Exception in thread "main"
Picked up _JAVA_OPTIONS: -Xmx512M
原因是android的生成版本为24,在使用该版生成的时候会报错需要降级为23即可
关于vs生成app错误提示,提醒Execution failed for task ':transformClassesWithDexForDebug'.的更多相关文章
- AS错误:Error:Execution failed for task ':gM99SDK:processReleaseResources'. > com.android.ide.common.process.ProcessException: org.gradle.process.internal.ExecException: Process 'command 'F:\BaiduYunDown
原因,buildToolsVersion 版本太低. 在build.gradle文件设置 buildToolsVersion 设置高一点,但必须是SDK里面有的.
- Error:Execution failed for task ':app:preDebugAndroidTestBuild'.错误解决
在新建布局文件的时候,页面显示: design editor is unavailable until a successful build(设计编辑器不可用,直到成功创建.) 细看下面还有一行错误: ...
- 我的Android进阶之旅------>解决:Execution failed for task ':app:transformResourcesWithMergeJavaResForDebug'.
错误描述 今天在Android Studio项目中加入了jackson的开发包,编译运行时候,引发了如下的错误: Error:Execution failed for task ':app:trans ...
- 我的Android进阶之旅------>解决:Execution failed for task ':app:transformResourcesWithMergeJavaResForDebug'.
错误描写叙述 今天在Android Studio项目中添加了jackson的开发包,编译执行时候.引发了例如以下的错误: Error:Execution failed for task ':app:t ...
- Error:Execution failed for task ':app:transformClassesWithDexForDebug'.
使用android studio 时,编译成功但用build apk时却报错 环境: android studio 1.5, jdk1.7 错误:Error:Execution failed for ...
- android开发里跳过的坑——android studio 错误Error:Execution failed for task ':processDebugManifest'. > Manifest merger failed with multiple errors, see logs
使用AS在gradle里配置了多个定制版本,发现在编译版本切换时,会出现错误: Error:Execution failed for task ':processDebugManifest'.> ...
- Error:Execution failed for task ':app:compileDebugAidl'. > java.lang.IllegalStateException: aidl is missing from '/Users/renguodong/Library/Android/sdk/build-tools/26.0.2/aidl'
错误信息:Error:Execution failed for task ':app:compileDebugAidl'. > java.lang.IllegalStateException: ...
- ANDROID打包错误ERROR:EXECUTION FAILED FOR TASK ´:APP:LINTVITALRELEASE´.
来自:http://dditblog.com/itshare_657.html 今天修改之前的项目之后.准备打包的时候.一起打包不了.一直提示有问题.错误是一些什么Strings.xml里面的一些信息 ...
- 【React Native错误集】* What went wrong: Execution failed for task ':app:installDebug'.
错误1:* What went wrong: Execution failed for task ':app:installDebug'. > com.android.builder.testi ...
随机推荐
- 匈牙利算法(codevs2776)
type node=^link; link=record des:longint; next:node; end; var n,m,i,t,num:longint; p:node; nd:..] of ...
- JavaScript学习笔记-自定义滚动条
这是一个基本实现思路,如果有新手和我一样没什么事,喜欢瞎研究话,可以参考下. 一.Html <div class="scroll_con"> <div class ...
- Go语言interface详解
interface Go语言里面设计最精妙的应该算interface,它让面向对象,内容组织实现非常的方便,当你看完这一章,你就会被interface的巧妙设计所折服. 什么是interface 简单 ...
- Bete冲刺第五阶段
Bete冲刺第五阶段 今日工作: web: 今日做的最大的工作是成功顺利的吧web部署到阿里云服务器上了,代码顺利在公网上跑,解决了与ios的网络连接问题.同时优化了几个接口的查询逻辑,减少了对数据库 ...
- Android下常见的四种对话框
摘要:在实际开发过程有时为了能够和用户进行很好的交互,需要使用到对话框,在Android中常用的对话框有四种:普通对话框.单选对话框.多选对话框.进度对话框. 一.普度对话框 public void ...
- [转]Mybatis出现:无效的列类型: 1111 错误
原文地址:http://www.cnblogs.com/sdjnzqr/p/4304874.html 在使用Mybatis时,不同的xml配置文件,有的会提示:无效的列类型: 1111 比如这个sql ...
- 关于Android中图片大小、内存占用与drawable文件夹关系的研究与分析
原文:关于Android中图片大小.内存占用与drawable文件夹关系的研究与分析 相关: Android drawable微技巧,你所不知道的drawable的那些细节 经常会有朋友问我这个问题: ...
- asp.net mvc 依赖缓存启动项配置
msdn 参考地址:https://msdn.microsoft.com/zh-cn/library/ms229862 4.5 第一步:32bit%windir%\Microsoft.NET\Fram ...
- the useful for loop
cp four_letter four_letter_bk for i in `ls /media/10TB/Stats/Assembly_marker` do cd /media/10TB/Stat ...
- springMVC数据验证出现404错误解决办法
今天使用springMVC的数据验证的时候,看似很简单的东西,却有一个很大的陷阱:提交空表单的时候总是出现404错误,但是后台却不给你报任何错.遇到这个错误这个很苦恼,搞了几小时,今天记录并分享一下解 ...