1.分析:

如果用 urllib.request.urlopen 方式打开一个URL,服务器端只会收到一个单纯的对于该页面访问的请求,但是服务器并不知道发送这个请求使用的浏览器,操作系统,硬件平台等信息,而缺失这些信息的请求往往都是非正常的访问,例如爬虫.
有些网站验证请求信息中的UserAgent(它的信息包括硬件平台、系统软件、应用软件和用户个人偏好),如果UserAgent存在异常或者是不存在,那么这次请求将会被拒绝(如上错误信息所示)
所以可以尝试在请求中加入UserAgent的信息
方案:
对于Python 3.x来说,在请求中添加UserAgent的信息非常简单,代码如下:
可以在请求加上头信息,伪装成浏览器访问User-Agent,具体的信息可以通过火狐的FireBug插件查询

headers = {'User-Agent':'Mozilla/5.0 (Windows NT 6.1; WOW64; rv:23.0) Gecko/20100101 Firefox/23.0'}  
req = request.Request(url=chaper_url, headers=headers)  
page  = request.urlopen(req).read() 
 
参考:https://www.cnblogs.com/lixiaolun/p/4773433.html 

python3 raise HTTPError(req.full_url, code, msg, hdrs, fp) urllib.error.HTTPError: HTTP Error 403: Forbid的更多相关文章

  1. urllib.error.HTTPError: HTTP Error 403: Forbidden

    问题:  urllib.request.urlopen() 方法经常会被用来打开一个网页的源代码,然后会去分析这个页面源代码,但是对于有的网站使用这种方法时会抛出"HTTP Error 40 ...

  2. python抓取不得姐动图(报错 urllib.error.HTTPError: HTTP Error 403: Forbidden)

    抓取不得姐动图(报错) # -*- coding:utf-8 -*- #__author__ :kusy #__content__:文件说明 #__date__:2018/7/23 17:01 imp ...

  3. python3 安装scrapy Exception: Traceback (most recent call last): File "/usr/lib/python3/dist-packages/pip/req/req_install.py", line 1006, in check_if_exists解决方法

    错误代码: Exception: Traceback (most recent call last): File , in check_if_exists self.satisfied_by = pk ...

  4. python3.6.5 + selenium +VS Code 运行报错:Unable to find a matching set of capabilities的解决

    在python3.6.5 + selenium +VS Code 环境中,在class的__init__ 方法初始化火狐浏览器时出现以下错误: 发生异常: selenium.common.except ...

  5. Python3安装turtle提示错误:Command "python setup.py egg_info" failed with error code 1

    Python3安装turtle提示错误:Command "python setup.py egg_info" failed with error code 1 Python3.5安 ...

  6. python3 使用urllib报错urlopen error EOF occurred in violation of protocol (_ssl.c:841)

    python3源码: import urllib.request from bs4 import BeautifulSoup response = urllib.request.urlopen(&qu ...

  7. raise RuntimeError("autoconf error") RuntimeError: autoconf error

    pip 安装模块时遇到下错误,没有粘贴全,差不多都是这样.这个情况是 pip 安装模块 需要 gcc 及 python-devle 支持, ubuntu 是 python-dev ,使用Yum 安装即 ...

  8. centos 7 运行Quartus ii 17.0 标准版,下载程序时遇到错误error (209053): unexpected error in jtag server -- error code 89

    对于错误error (209053): unexpected error in jtag server -- error code 89,它产生的原因在于,在linux系统下,Quartus ii的驱 ...

  9. 启动链码报rpc error: code = Unimplemented desc = unknown service protos.ChaincodeSupport start error

    参考链接:https://stackoverflow.com/questions/48007519/unimplemented-desc-unknown-service-protos-chaincod ...

随机推荐

  1. 一起来看看JavaScript中==和===有何不同

    '; // => true 如果其中一个值是true,则将其转换为1再进行比较.如果其中一个值是false,则将其转换为0再进行比较: true == 0; // => false fal ...

  2. Js 中对 Json 数组的常用操作

    我们首先定义一个json数组对象如下: var persons = [ {name: "tina", age: 14}, {name: "timo", age: ...

  3. apt-get update 系列作用

    sudo apt-get update 更新源 sudo apt-get upgrade 更新已安装的包 sudo apt-get dist-upgrade 升级系统 下面摘自知乎用户回答: apt- ...

  4. 用php和ajax写一个省市区的三级联动,实现地区的下拉选择

    要实现这个页面的三级联动,我们需要建立三个php文件,第一个php文件我们导入jQuery文件,里面嵌入JavaScript:第二个php文件我们做一个php的处理页面,里面引入我们封装好的数据库类文 ...

  5. SQLSERVER中的LOB页面简单研究

    SQLSERVER中的LOB页面简单研究 这篇文章和我另一篇文章是相辅相成的,在看<SQLSERVER2012 列存储索引的简单研究和测试>这篇文章之前希望大家先看一下这篇文章o(∩_∩) ...

  6. python常用模块之-random模块

    random模块顾名思义就是生成随机数的模块. random模块有以下常见方法: 1,打印0-1之间的任意随机浮点数,不能指定区间. print(random.random()) 2,打印随机符点数, ...

  7. SQL Server全文搜索(转载)

    看这篇文章之前请先看一下下面我摘抄的全文搜索的MSDN资料,基本上MSDN上关于全文搜索的资料的我都copy下来了并且非常认真地阅读和试验了一次,并且补充了一些SQL语句,这篇文章本人抽取了一些本人自 ...

  8. [CENTOS7] 将域群组加入到Sudoer里

    文章来源:https://derflounder.wordpress.com/2012/12/14/adding-ad-domain-groups-to-etcsudoers/ Adding AD d ...

  9. SQL删除多列语句

    最近在写SQL过程中发现需要对一张表结构作调整(此处是SQL Server),其中需要删除多列,由于之前都是一条SQL语句删除一列,于是猜想是否可以一条语句同时删除多列,如果可以,怎么写法? 第一次猜 ...

  10. pt-heartbeat --update --daemonize 只执行一次秒退的问题

    使用pt-heartbeat帮助测试MySQL从库delay时长- 第一次运行测试成功,运行顺畅. 过几天再次用--update测试时,发现pt-heartbeat只update一次就自己退出了,-- ...