(转) error: linker command failed with exit code 1 (use -v to see invocation)
像这样的一大堆,总体说编译链接时错误
/Users/zhangtianjian/Library/Developer/Xcode/DerivedData/ClothingOrders-bcmqkcjsfgyibbgetgiyczzqcerj/Build/Products/Debug-iphonesimulator/ClothingOrders.app/ClothingOrders normal i386
cd /Users/zhangtianjian/Desktop/SVN
setenv IPHONEOS_DEPLOYMENT_TARGET 6.1
setenv PATH "/Applications/Xcode.app/Contents/Developer/Platforms/iPhoneSimulator.platform/Developer/usr/bin:/Applications/Xcode.app/Contents/Developer/usr/bin:/usr/bin:/bin:/usr/sbin:/sbin"
/Applications/Xcode.app/Contents/Developer/Toolchains/XcodeDefault.xctoolchain/usr/bin/clang -arch i386 -isysroot /Applications/Xcode.app/Contents/Developer/Platforms/iPhoneSimulator.platform/Developer/SDKs/iPhoneSimulator6.1.sdk -L/Users/zhangtianjian/Library/Developer/Xcode/DerivedData/ClothingOrders-bcmqkcjsfgyibbgetgiyczzqcerj/Build/Products/Debug-iphonesimulator -L/Users/zhangtianjian/Desktop/SVN/ZBarSDK -F/Users/zhangtianjian/Library/Developer/Xcode/DerivedData/ClothingOrders-bcmqkcjsfgyibbgetgiyczzqcerj/Build/Products/Debug-iphonesimulator -filelist /Users/zhangtianjian/Library/Developer/Xcode/DerivedData/ClothingOrders-bcmqkcjsfgyibbgetgiyczzqcerj/Build/Intermediates/ClothingOrders.build/Debug-iphonesimulator/ClothingOrders.build/Objects-normal/i386/ClothingOrders.LinkFileList -Xlinker -objc_abi_version -Xlinker 2 -fobjc-link-runtime -Xlinker -no_implicit_dylibs -mios-simulator-version-min=6.1 -lz -framework MobileCoreServices -framework SystemConfiguration -framework CFNetwork -framework CoreData -liconv -framework QuartzCore -framework CoreVideo -framework CoreMedia -framework AVFoundation -framework UIKit -framework Foundation -framework CoreGraphics -lzbar -o /Users/zhangtianjian/Library/Developer/Xcode/DerivedData/ClothingOrders-bcmqkcjsfgyibbgetgiyczzqcerj/Build/Products/Debug-iphonesimulator/ClothingOrders.app/ClothingOrders
duplicate symbol _OBJC_METACLASS_$_EntityOrdersTotal in:
/Users/zhangtianjian/Library/Developer/Xcode/DerivedData/ClothingOrders-bcmqkcjsfgyibbgetgiyczzqcerj/Build/Intermediates/ClothingOrders.build/Debug-iphonesimulator/ClothingOrders.build/Objects-normal/i386/EntityOrdersTotal-1502FC93349A1D59.o
duplicate symbol _OBJC_CLASS_$_EntityOrdersTotal in:
/Users/zhangtianjian/Library/Developer/Xcode/DerivedData/ClothingOrders-bcmqkcjsfgyibbgetgiyczzqcerj/Build/Intermediates/ClothingOrders.build/Debug-iphonesimulator/ClothingOrders.build/Objects-normal/i386/EntityOrdersTotal-1502FC93349A1D59.o
ld: 2 duplicate symbols for architecture i386
clang: error: linker command failed with exit code 1 (use -v to see invocation)
ios开发这个错误一定少不了,现总结如下,一般这三方面的问题,如果不是哪你真可麻烦了
1.引用出错,把***.h弄成了.m,检查一下你的所有引用;
2.再就是你引用第三方的库,你添加文件是系统没有所第三方库的.m文件参入的编译中去,你向项目添加文件得注意了;
3.就是不小心添加的重复的类,向Entity之类,具体你可以看这里http://stackoverflow.com/questions/2264455/iphone-duplicate-symbol-error
顺便说一下http://stackoverflow.com/这个网站是iso开发不可少的一个网站;
4.有些frameworks没有添加进来也会出现上面的问题;
如果有第五的,请留言!
(转) error: linker command failed with exit code 1 (use -v to see invocation)的更多相关文章
- clang: error: linker command failed with exit code 1 (use -v to see invocation)
报错提示: ... ld: 6 duplicate symbols for architecture x86_64 clang: error: linker command failed with e ...
- 使用SVN clang: error: linker command failed with exit code 1 (use -v to see invocation)
然后上传到该项目SVN仓库上,例如,下面的错误再次发生再拉到本地编译 ld: library not found for -lxxxxxxxxxxxx clang: error: linker com ...
- "_OBJC_CLASS_$_ALAssetsLibrary", referenced from:和clang: error: linker command failed with exit code 1 (use -v to see invocation)错误
在项目中使用MWPhotoBrowser未导入ALAssetsLibrary类库时会导致编译时出现异常: "_OBJC_CLASS_$_ALAssetsLibrary", refe ...
- iOS cocoapods导入项目 出现 "___gxx_personality_v0", referenced from: 或者 clang: error: linker command failed with exit code 1 (use -v to see invocation) 错误
今天想导入PNChart 编译的时候出现了 "___gxx_personality_v0", referenced from: 和 clang: error: linker c ...
- Error:linker command failed with exit code 1 (use -v to see invocation) - iOS
今天在操作 CoreData 时,创建完 Create NSManagedObject Subclass... 后,工程中会自动生成四个文件,如下图所示: 此时此刻便以工程,激动人心的时刻来临了 ...
- clang: error: linker command failed with exit code 1 (use -v to see invocation) 无法定位的问题
编译出现错误:linker command failed with exit code 1 找到Build settings->Linking->Other Linker Flags,将此 ...
- 解决了clang: error: linker command failed with exit code 1 (use -v to see invocation) 解决方法
1.”Build Settings”->”Enable Bitcode”设置为NO 2.TARGETS --> Build Settings --> Architectures - ...
- Apple Mach-O Linker Error Group 与 "_OBJC_CLASS_$_XXXXXX", referenced from: 和 clang: error: linker command failed with exit code 1 (use -v to see invocation) 问题.
此问题为链接报错,在Build Settings中的Other Linker Flags添加:-l"XXXXXX"
- svn中第一次check out working copy项目下来出现 ld: library not found for -lcrypto clang: error: linker command failed with exit code 1 (use -v to see invocation)
这个问题主要是.a文件的忽略删除,需要更改设置,并且把文件重新添加
随机推荐
- POJ 1787 Charlie's Change (完全背包/多重背包,输出方案的物品个数)
网上说是多重背包,因为要输出方案,还要记录下路径,百度一下题解就可以. 自己做的时候,还没了解过多重背包,该题直接往完全背包思考了.咖啡的钱看作总的背包容量,1.5.10.25分别代表四种物品的重量, ...
- NSArray block用法
28.使用block 块遍历整个数组.这个block 需要三个参数,id obj 表示数组中的元素. NSUInteger idx 标示元素的下标, bool *stop 是一个bool类型的参数. ...
- Linux之select系统调用_1
SYNOPSIS /* According to POSIX.1-2001 */ #include <sys/select.h> /* According to earlier stand ...
- 绑定CPU
处理器的亲和性 软亲和性(affinity) 意味着进程并不会在处理器之间频繁迁移,而 硬亲和性(affinity) 则意味着进程需要在您指定的处理器上运行. 通常 Linux 内核都可以很好地对进程 ...
- hdu 3032 Nim or not Nim?(搜索打SG表)
题意: 有n堆石子,alice先取,每次可以选择拿走一堆石子中的1~x(该堆石子总数) , 也可以选择将这堆石子分成任意的两堆.alice与bob轮流取,取走最后一个石子的人胜利. 思路: 因为数的范 ...
- VBA高效删除不连续多行
最近在搞VBA,在感叹Excel功能强大的同时,对于新接触的一门编程语言也很烦恼.很多基础的语法都要靠网上搜索.现总结一些学习到的心得. VBA高效删除不连续多行 在一个拥有几万条数据的Excel中, ...
- java web线程池
线程池 要知道在计算机中任何资源的创建,包括线程,都需要消耗系统资源的.在WEB服务中,对于web服 务器的响应速度必须要尽可能的快,这就容不得每次在用户提交请求按钮后,再创建线程提供服务 .为了减少 ...
- 搭建turnserver
参考文件: http://blog.csdn.net/kl222/article/details/20145423 为什么要搭建TURN服务器? 因为我们编写的sip客户端再和南瑞的sip服务器进行通 ...
- Sublime Text 新建文件可选类型的模版插件: SublimeTmpl
安装方法: 1.Ctrl+Shift+P打开控制台, 2.输入IP安装插件 3.输入tmpl 回车安装 编辑模版在:SublimeTmpl\templates"文件夹修改 其他情况: htt ...
- JS解析json数据
JS解析json数据(如何将json字符串转化为数组) 1 <!DOCTYPE HTML PUBLIC "-//W3C//DTD HTML 4.0 Transitional//EN&q ...