今天使用maven打包项目的时候出现下面的错误,提示org.junit不存在。

错误信息内容如下:

[ERROR] /Users/aven/Documents/workspace/share/src/test/java/com/weixiao/share/test/TestMyBatis.java:[8,16] 错误: 程序包org.junit不存在
[ERROR] /Users/aven/Documents/workspace/share/src/test/java/com/weixiao/share/test/TestMyBatis.java:[9,23] 错误: 程序包org.junit.runner不存在
[ERROR] /Users/aven/Documents/workspace/share/src/test/java/com/weixiao/share/test/TestMyBatis.java:[18,1] 错误: 找不到符号
[ERROR] 类 RunWith
/Users/aven/Documents/workspace/share/src/test/java/com/weixiao/share/test/TestMyBatis.java:[37,2] 错误: 找不到符号
[INFO] 4 errors
[INFO] -------------------------------------------------------------
[INFO] ------------------------------------------------------------------------
[INFO] BUILD FAILURE
[INFO] ------------------------------------------------------------------------
[INFO] Total time: 15.024 s
[INFO] Finished at: 2017-04-14T13:34:37+08:00
[INFO] Final Memory: 31M/280M
[INFO] ------------------------------------------------------------------------
[ERROR] Failed to execute goal org.apache.maven.plugins:maven-compiler-plugin:2.3.2:testCompile (default-testCompile) on project share: Compilation failure: Compilation failure:
[ERROR] /Users/aven/Documents/workspace/share/src/test/java/com/weixiao/share/test/TestMyBatis.java:[8,16] 错误: 程序包org.junit不存在
[ERROR] /Users/aven/Documents/workspace/share/src/test/java/com/weixiao/share/test/TestMyBatis.java:[9,23] 错误: 程序包org.junit.runner不存在
[ERROR] /Users/aven/Documents/workspace/share/src/test/java/com/weixiao/share/test/TestMyBatis.java:[18,1] 错误: 找不到符号
[ERROR] 类 RunWith
[ERROR] /Users/aven/Documents/workspace/share/src/test/java/com/weixiao/share/test/TestMyBatis.java:[37,2] 错误: 找不到符号
[ERROR] -> [Help 1]
[ERROR]
[ERROR] To see the full stack trace of the errors, re-run Maven with the -e switch.
[ERROR] Re-run Maven using the -X switch to enable full debug logging.
[ERROR]
[ERROR] For more information about the errors and possible solutions, please read the following articles:
[ERROR] [Help 1] http://cwiki.apache.org/confluence/display/MAVEN/MojoFailureException

但是程序测试的时候是没有问题的,这也就说明junit的依赖是引入了的。

修改方法:修改下面的代码

最开始的如下:

修改后的代码:

然后发现进入可以达成了jar包,具体为什么还不清楚。

eclipse maven程序包org.junit不存在的更多相关文章

  1. Error:(4, 17) java: 程序包org.junit不存在

    内容:Error:(4, 17) java: 程序包org.junit不存在 场景:运行测试类的时候,IED新建一个自己的项目,并且不用maven的情况下 解决方案:File -> Projec ...

  2. Maven:程序包不存在,找不到符号

    maven build时出现了以下的错误: 程序包xx.xx不存在,xxx找不到符号 原因一:DAO层依赖Service接口层的Bean类,在pom.xml中添加了对Service的依赖,也因此引入了 ...

  3. Eclipse开发Maven项目提示:程序包org.junit不存在解决方案

    原因: 个人考虑产生此错误的原因是因为Eclipse中对于测试和开发的鉴定不明?Intellij中没有错误,因为Intellij对项目的管理就是同Maven结构的. 解决方案: 原来的junit的sc ...

  4. maven 错误: 程序包org.junit不存在

    该错误在入门例子中使用mvn clean test时出现该错误. 原因: 测试用例应该放在src/test/java/...路径下,我是放在了src/main/java/..路径下了. 因为没有遵守其 ...

  5. 程序包org.junit不存在

    三种解决方法 第一种 maven的改法 <dependency>            <groupId>junit</groupId>            &l ...

  6. 程序包org.junit不存在和编码GBK的不可映射字符问题解决

    maven项目在打包编译时提示: 解决办法: 将pom中junit依赖中的scope给注释掉 <dependency> <groupId>junit</groupId&g ...

  7. maven 程序包com.sun.image.codec.jpeg

    在 Pom.xml 增加 <build> <plugins> <plugin> <artifactId>maven-compiler-plugin< ...

  8. Eclipse+Maven+Scala Project+Spark | 编译并打包wordcount程序

    学习用Eclipse+Maven来构建并打包一个简单的单词统计的例程. 本项目源码已托管于Github –>[Spark-wordcount] 第一步 在EclipseIDE中安装Scala插件 ...

  9. idea启动java Maven项目,出现" java: 程序包xxxx不存在"

    今天运行Maven项目的时候,出现了,Error:(19, 17) java: 程序包tracetool不存在的情况 本人的解决办法: (1)首先确保maven  pom文件不能报错,即文件上面不能有 ...

随机推荐

  1. PHP 中for循环的一个小小改进

    注意 : 1, $size这个值可以放在for循环中的第一个 ';' 前声明, 因为这个声明只会执行一次; 2, 第二个 ';' 中的内容, 会重复运行, 所以$i < $size 这个判断会每 ...

  2. IIS如何避免子web应用程序中继承根目录web.config配置

    1.一种方式,需要改动根目录的web.config(不是很推荐) <?xml version="1.0"?> <configuration> <loc ...

  3. Openwrt单独编译某一个模块而不是整个固件

    make package/rt2860v2/compile 就是在make menuconfig那个目录下执行此命令就会编译rt2860v2这个模块

  4. “网易大数据讲堂第一期:数说”直播活动资料:课程回放收看及PPT下载

    欢迎访问网易云社区,了解更多网易技术产品运营经验. "网易大数据讲堂第一期:数说"直播活动昨晚顺利举行.感谢各位"数"友的支持和参与. 本次活动PPT可点击这里 ...

  5. Glib学习笔记(三)

    你将学到什么 如何实现Object的方法 Object的方法 Object的public方法 在头文件声明一个函数,然后在源文件中实现函数即可 /* declaration in the header ...

  6. Django之博客系统:用户登陆

    使用django有一个好处就是有各种各样的框架可以拿来直接使用.相比flask,django自带的框架确实要多很多.比如这一章就要介绍的用户登录.Django拥有一个内置的认证(authenticat ...

  7. NSNull空值

    1.前言 作为占据空间的一个空值,如用在数组或字典中占据一个没有任何值的空间. 1.1 NULL & nil 的区别: nil 是 OC 的,空对象,地址指向空的对象,指针地址指向的是 NUL ...

  8. 正交表生成工具 PICT 成对组合覆盖 收藏

    收藏:https://www.cnblogs.com/wmjperson/p/4557246.html

  9. Sum of LCM (lcmsum)

    题目 [题目描述] 对于 $ A_1, A_2, \ldots, A_N $ ,求$\sum_{i = 1}^N \sum_{j = 1}^N \mathrm{lcm}(A_i, A_j)$ 的值. ...

  10. 一些意想不到的小bug。

    一,当if的时候,很容易忘记相对的else,从而出现bug,要将背面消息考虑全面. 二,多个元素在同一行布局的时候,要考虑文字的换行还是省略号代替. 例如:左边一个文字,宽度不固定,右边一个图形,宽度 ...