Snorkel使用SQLAlchemy作为数据管理工具,在本地会生成一个.db文件,现有操作与.db文件中已有的记录重复,违反了数据库主键不能重复的性质

解决方式:

You can load a labeled dev set json file by replacing the following line:
gold_labels = get_gold_labels(session)
with:
reload_external_labels(session, HW_DIR / "gold_labels.dev.json")
gold_labels = load_gold_labels(session, annotator_name='gold', split=1)
 
并且删除.db文件

snorkel SentenceNgramViewer 标记时出现 Integrity Error的更多相关文章

  1. 使用phpmailer发送smtp邮件时提示 SMTP Error: Could not authenticate 错误

    使用phpmailer发送smtp邮件时提示 SMTP Error: Could not authenticate 错误 这个错误是验证出现错误, $mail->Port = 25; //SMT ...

  2. maven install 读取jar包时出错;error in opening zip file

    错误信息: [INFO] ------------------------------------------------------------------------ [ERROR] Failed ...

  3. redhat 中安装rpm包时遇到异常 “error: Failed dependencies:xinetd is needed by .”

    redhat 中安装rpm包时遇到错误 “error: Failed dependencies:xinetd is needed by ....” redhat中安装rpm包时遇到“error: Fa ...

  4. LR_问题_在导入wsdl时出现parsing error

    问题描述:使用LR录制webservice协议的脚本,在导入wsdl时出现parsing error,详见图 问题解决:在导入wsdl时输入的地址错误,只指定了地址的虚拟目录名称,未指定方法名称,应该 ...

  5. 在hive中查询导入数据表时FAILED: SemanticException [Error 10096]: Dynamic partition strict mode requires at least one static partition column. To turn this off set hive.exec.dynamic.partition.mode=nonstrict

    当我们出现这种情况时 FAILED: SemanticException [Error 10096]: Dynamic partition strict mode requires at least ...

  6. LR运行场景时出现的error

    LR运行场景时出现的error 1.Action.c(24): Error -27740: Overlapped transmission of request to "home.asiai ...

  7. 安装nagios-plugins插件make时遇到的error

    安装nagios-plugins插件make时遇到的error error内容: check_http.c: In function ‘process_arguments’: check_http.c ...

  8. Mysql插入中文时提示:ERROR 1366 (HY000): Incorrect string value: '\xE5\x8F\xB0\xE5\xBC\x8F...' fo

    Mysql插入数据时提示:ERROR 1366 (HY000): Incorrect string value: ‘\xE5\x8F\xB0\xE5\xBC\x8F…’ fo 分析如下: 首先通过语句 ...

  9. MySql 执行 DELETE/UPDATE时,报 Error Code: 1175错误

    MySql 执行 DELETE FROM Table 时,报 Error Code: 1175. You are using safe update mode and you tried to upd ...

  10. 用python调试Appium和雷电模拟器连接时出现Original error: Could not find 'adb.exe' in PATH

    用python调试Appium和雷电模拟器连接时出现Original error: Could not find 'adb.exe' in PATH 确定环境变量没错,用管理员启动Appium就不会出 ...

随机推荐

  1. slitaz5安装vim,sakura终端命令行打不开

    刚开始安装了vim后,vim提示libtinof.so.6打不开.在网上查,发现可能是库缺少.然后查看了依赖库文件 ldd /usr/bin/vim 发现果然缺少了 libncurses.so.6 的 ...

  2. C#笔记誊录<二>

    c#编译器把源码编译成IL(中间)代码,再由CLR通过即时编译器把IL代码编译成本机机器语言(平台语言) www.webkaka.com//测试服务器的网速 ctrl+k+d 代码对其 CTRL+K+ ...

  3. java对excel的操作

    1.对比任意两张excel表是否有不同行 并输出哪一行那一列不同 2.包含解析合并单元格方法 3.比较主要思路 a.解析excel: b.遍历第一张表数据所有行 c.遍历第二张表数据所有行 d.遍历第 ...

  4. bootstrap table表格按钮

    1 <body> 2 3 <form action="" method="POST" class="form-horizontal& ...

  5. mysql中char和varchar的区别

    char的长度是不可变的,是定长的, varchar的长度是可变的,不定长的: 但是char的存取速度比varchar快,因为其长度固定,方便存储和查找. char空间换时间,varchar时间换空间 ...

  6. Android学习——控件ImageView

    1.主要属性 2.缩放类型

  7. python 提取文件的名字 和路径

    # coding=utf-8 import sys import os s = 'C:/Users/Desktop/lesson/python/calss1.py' m_dir = os.path.d ...

  8. ider git Reset Type 使用记录

    Soft:在选定提交点之后所做的所有更改都将被暂存(这意味着可以到 Version Control 窗口(Alt+9)的Local Changes 选项卡,以便您可以查看它们,并在必要时稍后提交). ...

  9. 计算机科学导论-第三版-学习笔记-chapter1-绪论

    小测验的网站找不到,小程序也找不到,这两个部分的习题就不做了. Cengage Learning - Foundations of Computer Science这上面有部分答案.这里用斜体标出.我 ...

  10. Using Yocto Project with BeagleBone Black 英文版、Using Yocto Project with BeagleBone Black中文版

    Using Yocto Project with BeagleBone Black  手册英文版.中文版 https://market.m.taobao.com/app/idleFish-F2e/wi ...