编码GBK的不可映射字符
1、错误描写叙述
[ERROR] /E:/Eclipse/workspace/huxs/src/test/java/com/you/huxs/utils/SpringTestBase.java:[14,12] 编码GBK的不可映射字符
[ERROR] /E:/Eclipse/workspace/huxs/src/test/java/com/you/huxs/utils/SpringTestBase.java:[15,6] 编码GBK的不可映射字符
[ERROR] /E:/Eclipse/workspace/huxs/src/test/java/com/you/huxs/utils/SpringTestBase.java:[19,12] 编码GBK的不可映射字符
[ERROR] /E:/Eclipse/workspace/huxs/src/test/java/com/you/huxs/utils/SpringTestBase.java:[19,17] 编码GBK的不可映射字符
[ERROR] /E:/Eclipse/workspace/huxs/src/test/java/com/you/huxs/utils/SpringTestBase.java:[19,19] 编码GBK的不可映射字符
[ERROR] /E:/Eclipse/workspace/huxs/src/test/java/com/you/huxs/utils/SpringTestBase.java:[19,22] 编码GBK的不可映射字符
[ERROR] /E:/Eclipse/workspace/huxs/src/test/java/com/you/huxs/utils/SpringTestBase.java:[20,12] 编码GBK的不可映射字符
[ERROR] /E:/Eclipse/workspace/huxs/src/test/java/com/you/huxs/utils/SpringTestBase.java:[30,16] 编码GBK的不可映射字符
[ERROR] /E:/Eclipse/workspace/huxs/src/test/java/com/you/huxs/utils/SpringTestBase.java:[30,39] 编码GBK的不可映射字符
[ERROR] /E:/Eclipse/workspace/huxs/src/test/java/com/you/huxs/utils/SpringTestBase.java:[31,16] 编码GBK的不可映射字符
[ERROR] /E:/Eclipse/workspace/huxs/src/test/java/com/you/huxs/utils/SpringTestBase.java:[31,21] 编码GBK的不可映射字符
[ERROR] /E:/Eclipse/workspace/huxs/src/test/java/com/you/huxs/utils/SpringTestBase.java:[31,23] 编码GBK的不可映射字符
[ERROR] /E:/Eclipse/workspace/huxs/src/test/java/com/you/huxs/utils/SpringTestBase.java:[31,26] 编码GBK的不可映射字符
[ERROR] /E:/Eclipse/workspace/huxs/src/test/java/com/you/huxs/utils/SpringTestBase.java:[32,14] 编码GBK的不可映射字符
[ERROR] /E:/Eclipse/workspace/huxs/src/test/java/com/you/huxs/utils/SpringTestBase.java:[36,16] 编码GBK的不可映射字符
[ERROR] /E:/Eclipse/workspace/huxs/src/test/java/com/you/huxs/utils/SpringTestBase.java:[6,24] 程序包org.junit.runner不存在
[ERROR] /E:/Eclipse/workspace/huxs/src/test/java/com/you/huxs/utils/SpringTestBase.java:[7,40] 程序包org.springframework.test.context不存在
[ERROR] /E:/Eclipse/workspace/huxs/src/test/java/com/you/huxs/utils/SpringTestBase.java:[8,47] 程序包org.springframework.test.context.junit4不存在
[ERROR] /E:/Eclipse/workspace/huxs/src/test/java/com/you/huxs/utils/SpringTestBase.java:[9,52] 程序包org.springframework.test.context.transaction不存在
[ERROR] /E:/Eclipse/workspace/huxs/src/test/java/com/you/huxs/utils/SpringTestBase.java:[10,50] 程序包org.springframework.transaction.annotation不存在
[ERROR] /E:/Eclipse/workspace/huxs/src/test/java/com/you/huxs/utils/SpringTestBase.java:[22,2] 找不到符号
符号: 类 RunWith
[ERROR] /E:/Eclipse/workspace/huxs/src/test/java/com/you/huxs/utils/SpringTestBase.java:[23,2] 找不到符号
符号: 类 ContextConfiguration
[ERROR] /E:/Eclipse/workspace/huxs/src/test/java/com/you/huxs/utils/SpringTestBase.java:[24,2] 找不到符号
符号: 类 Transactional
[ERROR] /E:/Eclipse/workspace/huxs/src/test/java/com/you/huxs/utils/SpringTestBase.java:[25,2] 找不到符号
符号: 类 TransactionConfiguration
[INFO] 24 errors
[INFO] -------------------------------------------------------------
[INFO] ------------------------------------------------------------------------
[INFO] BUILD FAILURE
[INFO] ------------------------------------------------------------------------
[INFO] Total time: 2.486 s
[INFO] Finished at: 2016-01-12T17:59:17+08:00
[INFO] Final Memory: 11M/171M
[INFO] ------------------------------------------------------------------------
[ERROR] Failed to execute goal org.apache.maven.plugins:maven-compiler-plugin:3.1:testCompile (default-testCompile) on project huxs: Compilation failure: Compilation failure:
[ERROR] /E:/Eclipse/workspace/huxs/src/test/java/com/you/huxs/utils/SpringTestBase.java:[14,12] 编码GBK的不可映射字符
[ERROR] /E:/Eclipse/workspace/huxs/src/test/java/com/you/huxs/utils/SpringTestBase.java:[15,6] 编码GBK的不可映射字符
[ERROR] /E:/Eclipse/workspace/huxs/src/test/java/com/you/huxs/utils/SpringTestBase.java:[19,12] 编码GBK的不可映射字符
[ERROR] /E:/Eclipse/workspace/huxs/src/test/java/com/you/huxs/utils/SpringTestBase.java:[19,17] 编码GBK的不可映射字符
[ERROR] /E:/Eclipse/workspace/huxs/src/test/java/com/you/huxs/utils/SpringTestBase.java:[19,19] 编码GBK的不可映射字符
[ERROR] /E:/Eclipse/workspace/huxs/src/test/java/com/you/huxs/utils/SpringTestBase.java:[19,22] 编码GBK的不可映射字符
[ERROR] /E:/Eclipse/workspace/huxs/src/test/java/com/you/huxs/utils/SpringTestBase.java:[20,12] 编码GBK的不可映射字符
[ERROR] /E:/Eclipse/workspace/huxs/src/test/java/com/you/huxs/utils/SpringTestBase.java:[30,16] 编码GBK的不可映射字符
[ERROR] /E:/Eclipse/workspace/huxs/src/test/java/com/you/huxs/utils/SpringTestBase.java:[30,39] 编码GBK的不可映射字符
[ERROR] /E:/Eclipse/workspace/huxs/src/test/java/com/you/huxs/utils/SpringTestBase.java:[31,16] 编码GBK的不可映射字符
[ERROR] /E:/Eclipse/workspace/huxs/src/test/java/com/you/huxs/utils/SpringTestBase.java:[31,21] 编码GBK的不可映射字符
[ERROR] /E:/Eclipse/workspace/huxs/src/test/java/com/you/huxs/utils/SpringTestBase.java:[31,23] 编码GBK的不可映射字符
[ERROR] /E:/Eclipse/workspace/huxs/src/test/java/com/you/huxs/utils/SpringTestBase.java:[31,26] 编码GBK的不可映射字符
[ERROR] /E:/Eclipse/workspace/huxs/src/test/java/com/you/huxs/utils/SpringTestBase.java:[32,14] 编码GBK的不可映射字符
[ERROR] /E:/Eclipse/workspace/huxs/src/test/java/com/you/huxs/utils/SpringTestBase.java:[36,16] 编码GBK的不可映射字符
[ERROR] /E:/Eclipse/workspace/huxs/src/test/java/com/you/huxs/utils/SpringTestBase.java:[6,24] 程序包org.junit.runner不存在
[ERROR] /E:/Eclipse/workspace/huxs/src/test/java/com/you/huxs/utils/SpringTestBase.java:[7,40] 程序包org.springframework.test.context不存在
[ERROR] /E:/Eclipse/workspace/huxs/src/test/java/com/you/huxs/utils/SpringTestBase.java:[8,47] 程序包org.springframework.test.context.junit4不存在
[ERROR] /E:/Eclipse/workspace/huxs/src/test/java/com/you/huxs/utils/SpringTestBase.java:[9,52] 程序包org.springframework.test.context.transaction不存在
[ERROR] /E:/Eclipse/workspace/huxs/src/test/java/com/you/huxs/utils/SpringTestBase.java:[10,50] 程序包org.springframework.transaction.annotation不存在
[ERROR] /E:/Eclipse/workspace/huxs/src/test/java/com/you/huxs/utils/SpringTestBase.java:[22,2] 找不到符号
[ERROR] 符号: 类 RunWith
[ERROR] /E:/Eclipse/workspace/huxs/src/test/java/com/you/huxs/utils/SpringTestBase.java:[23,2] 找不到符号
[ERROR] 符号: 类 ContextConfiguration
[ERROR] /E:/Eclipse/workspace/huxs/src/test/java/com/you/huxs/utils/SpringTestBase.java:[24,2] 找不到符号
[ERROR] 符号: 类 Transactional
[ERROR] /E:/Eclipse/workspace/huxs/src/test/java/com/you/huxs/utils/SpringTestBase.java:[25,2] 找不到符号
[ERROR] 符号: 类 TransactionConfiguration
[ERROR] -> [Help 1]
[ERROR]
[ERROR] To see the full stack trace of the errors, re-run Maven with the -e switch.
[ERROR] Re-run Maven using the -X switch to enable full debug logging.
[ERROR]
[ERROR] For more information about the errors and possible solutions, please read the following articles:
[ERROR] [Help 1] http://cwiki.apache.org/confluence/display/MAVEN/MojoFailureException
2、错误原因
因为将项目从SVN上检出的编码格式是UTF-8,Maven编译时使用的是GBK编码。两个编码不一致导出出错
3、解决的方法
在pom.xml中加入编码格式:
<plugin>
<groupId>org.apache.maven.plugins</groupId>
<artifactId>maven-compiler-plugin</artifactId>
<version>3.3.1</version>
<configuration>
<source>1.7</source>
<target>1.7</target>
<encoding>utf8</encoding>
</configuration>
</plugin>
编码GBK的不可映射字符的更多相关文章
- 使用cmd打开java文件,报错:“错误,编码GBK的不可映射字符”
今天使用EditPlus写了一个小程序,用cmd运行时报错--"错误,编码GBK的不可映射字符". 处理办法是用EditPlus另存为时,把编码格式由UTF-8改为ANSI. 然后 ...
- “maven编码gbk的不可映射字符”解决办法
一.问题描述 Eclipse中使用Maven编译项目源代码时,如下的错误 java源代码在Eclipse中显示是没有任何错误的,可是执行"maven install"命令编译项目时 ...
- 解决Gradle编译时出现: 编码GBK的不可映射字符
解决Gradle编译时出现: 编码GBK的不可映射字符 在build.gradle文件中加入如下内容: [compileJava, compileTestJava]*.options*.encodin ...
- javadoc错误: 编码gbk的不可映射字符
在使用Eclipse进行javadoc的导出时,提示“编码 GBK 的不可映射字符”,应该就是中文注释Eclipse不认,需要在调用javadoc.exe的时候传递编码集告诉它采用什么编码去生成jav ...
- 【20140113-2】MyEclipse生成javadoc时出错:编码GBK的不可映射字符
今天生成java doc文档时,出现了如下所示的错误: 正在装入软件包 com.wisdom.test 的源文件...F:\workspace\StringUtils\src\com\wisdom\t ...
- 使用Maven编译项目遇到——“maven编码gbk的不可映射字符”解决办法 ——转载
一.问题描述 今天在MyEclipse中使用Maven编译项目源代码时,结果如下了如下的错误
- maven异常解决:编码GBK的不可映射字符
直接将项目改为UTF-8编码,无效!要通过修改pom.xml文件,告诉maven这个项目使用UTF-8来编译. 一.问题描述 今天在MyEclipse中使用Maven编译项目源代码时,结果如下了如下的 ...
- javac编译提示编码GBK的不可映射字符
使用命令行javac命令编译java文件, 提示错误:编码GBK的不可映射字符. 在编译的时候,如果我们没有用-encoding参数指定我们的JAVA源程序的编码格式,则javac.exe会获得我们操 ...
- javac 错误: 编码GBK的不可映射字符
在java代码中有中文注释,使用javac编译时,出现编码报错. 错误: 编码GBK的不可映射字符 问题原因: 在编译的时候,如果我们没有用-encoding参数指定我们的JAVA源程序的编码格式,则 ...
- maven编译时候报"编码 GBK 的不可映射字符"
决这个问题的思路: 在maven的编译插件中声明正确的字符集编码编码——编译使用的字符集编码与代码文件使用的字符集编码一致!! 安装系统之后,一般中文系统默认字符集是GBK.我们安装的软件一般都继承使 ...
随机推荐
- dtrace 相关资料
Here are some DTrace information sources: * [Oracle Wiki](https://wikis.oracle.com/display/DTrace/DT ...
- Snmp学习总结(七)——SNMP4J介绍
一.SNMP4J介绍 SNMP4J是一个用Java来实现SNMP(简单网络管理协议)协议的开源项目.它支持以命令行的形式进行管理与响应.SNMP4J是纯面向对象设计与SNMP++(用C++实现SNMP ...
- 统计代码执行时间,使用Stopwatch和UserProcessorTime的区别
当我们需要统计一段代码的执行时间,首先想到的可能是Stopwatch类.在这里,先暂不使用Stopwatch,自定义一个统计代码执行时间的类,大致需要考虑到: 1.确保统计的是当前进程.当前线程中代码 ...
- android:activity活动的生命周期
掌握活动的生命周期对任何 Android 开发者来说都非常重要,当你深入理解活动的生命 周期之后,就可以写出更加连贯流畅的程序,并在如何合理管理应用资源方面,你会发挥的 游刃有余.你的应用程序将会拥有 ...
- Xcode6 itunes完美打包api 方法
转:http://bbs.csdn.net/topics/390948190 Xcode6 itunes完美打包api 方法! 特点轻盈小巧,方便快捷!
- IOS开发之——objective-c与javascript交互
原文:http://blog.csdn.net/pjk1129/article/details/6936545 在写 JavaScript 的时候,可以使用一个叫做 window 的对象,像是我们想要 ...
- 一个exception
今天调错,发生了一个错误:java.lang.IllegalStateException: ApplicationEventMulticaster not initialized [closed] 后 ...
- cocos2d-x中使用CCOrbitCamera做水平翻转
项目中需要用到水平翻转效果,这里偷懒了- 首先翻转,它只是转到了180度,多了就觉得很奇怪了. 所以这里设定就是先从0 ~ 90度,然后再从270 ~ 360,90 – 270 视觉上是感觉不到变 ...
- SVG.Js事件示例,简单绑定拖动操作
一.代码: var draw = SVG('container').size(300, 300); draw.style({ border: '1px solid red' }); var group ...
- 如何解决rar文件解压缩失败
附件经常会是一系列的压缩文件,下载是默认文件名是一个随机数字.因而下载完会出现压缩文件解压缩失败解决方法:下载时重命名为带一定顺序的文件名,如文件1,文件2,文件3等 如何解决单个文件解压失败?论坛中 ...