unittest简介
unittest是python里面的单元测试框架
1 unittest 简介
1).先导入 unittest
2).用 help 函数查看源码解析
3).查看描述:
Python unit testing framework, based on Erich Gamma's JUnit and KentBeck's Smalltalk testing framework.
翻译:python 的单元测试框架,是基于 java 的 junit 测试框架
2 unittest使用
1).第一行是导入 unittest 这个模块
2).class 这一行是定义一个测试的类,并继承 unittest.TestCase 这个类
3).接下来是定义了四个测试 case 名称:testAdd 、 testMul、testMinus、testDiv
4).注释里面有句话很重要,这个要敲下黑板记笔记了: ## test method namesb b egin 'test*' -- 翻译:测试用例的名称要以 t test 开头
5).然后是断言 assert,这里的断言方法是 assertEqual-判断两个是否相等,这个断言可以是一个也可以是多个
6).if 下面的这个 unittest.main()是运行主函数,运行后会看到测试结果:
参考源码:
# coding:utf-8
import unittest
class IntegerArithmeticTestCase(unittest.TestCase): # test method namesb b egin 'test*'
def testAdd(self):
self.assertEquals((1+2), 3)
self.assertEquals((0+1), 1) def testMul(self):
self.assertEquals((0*5), 0)
self.assertEquals((10*5), 50) def testMinus(self):
result = 6-5
hope = 1
self.assertEquals(result, hope) def testDiv(self):
result = 7/2
hope = 3
self.assertEquals(result, hope) if __name__ == '__main__':
unittest.main()
* 注意:
当断言没有通过时,就会报错,例如将上面最后一个用例的期望结果改为hope=3.5,执行结果就会报错

最后运行结果,第四个是失败的,失败原因:AssertionError: 3 != 3.5
F.
=====================================================================
=
FAIL: testDivide (__main__.Test)
这里是测试除法
---------------------------------------------------------------------
-
Traceback (most recent call last):
File "D:/test/web-project/p.py", line 14, in testDivide
self.assertEqual(result, hope)
AssertionError: 3 != 3.5
---------------------------------------------------------------------
-
Ran 4 tests in 0.004s
FAILED (failures=1)
3 前置和后置
1).setUp:在写测试用例的时候,每次操作其实都是基于打开浏览器输入对应网址这些操作,这个就是执行用例的前置条件。
2).tearDown:执行完用例后,为了不影响下一次用例的执行,一般有个数据还原的过程,这就是执行用例的后置条件。
3).很多人执行完用例,都不去做数据还原,以致于下一个用例执行失败习惯不好。
4).前置和后置都是非必要的条件,如果没有也可以写 pass

完整案例:
# coding:utf-8
from selenium import webdriver
from selenium.webdriver.support import expected_conditions as EC
import time
import unittest
class Blog(unittest.TestCase):
# 前置操作
def setUp(self):
self.driver = webdriver.Firefox()
self.driver.get("http://www.cnblogs.com/101718qiong/")
self.driver.maximize_window()
# 测试用例
def test_blog(self):
time.sleep(3)
result = EC.title_is(u'Silence&QH - 博客园')(self.driver)
print result
self.assertTrue(result)
# 后置操作
def tearDown(self):
self.driver.quit() if __name__ == "__main__":
unittest.main()
unittest简介的更多相关文章
- 3.1 unittest简介
3.1 unittest简介 前言 熟悉java的应该都清楚常见的单元测试框架Junit和TestNG.python里面也有单元测试框架-unittest,相当于是一个python版的junit.py ...
- unittest简介01
前言 熟悉java的应该都清楚常见的单元测试框架Junit和TestNG,python里面也有单元测试框架-unittest,相当于是一个python版的junit. 一.unittest简介 1.先 ...
- python接口自动化(二十一)--unittest简介(详解)
简介 前边的随笔主要介绍的requests模块的有关知识个内容,接下来看一下python的单元测试框架unittest.熟悉 或者了解java 的小伙伴应该都清楚常见的单元测试框架 Junit 和 T ...
- 自动化测试基础篇--Selenium unittest简介
一.什么是unittest unittest是Python单元测试框架,类似于JUnit框架. unittest中有4个重要的概念:test fixture, test case, test suit ...
- unittest系列(一)unittest简介和示例
unittest - 单元测试框架 单元测试框架是受到 JUnit 的启发,与其他语言中的主流单元测试框架有着相似的风格.其支持测试自动化,配置共享和关机代码测试.支持将测试样例聚合到测试集中,并将测 ...
- python+selenium自动化软件测试(第3章):unittest
3.1 unittest简介 前言(python基础比较弱的,建议大家多花点时间把基础语法学好,这里有套视频,可以照着练习下:http://pan.baidu.com/s/1i44jZdb 密码:92 ...
- XUnit测试框架-Python unittest
选择 语言选择 本次个人作业我选择的语言是Python,了解学习Python有一段时间了但是一直没有练习,所以这次玩蛇,使用的版本是Python3.6. 开发工具选择 我选择的IDE是Pycharm, ...
- Python单元测试unittest - 单元测试框架
一.unittest简介 unitest单元测试框架最初是有JUnit的启发,它支持测试自动化,共享测试的设置和关闭代码,将测试聚合到集合中,以及测试与报告框架的独立性. 二.unittest相关概念 ...
- unittest测试
标签(空格分隔): unittest unittest介绍: python里面也有单元测试框架-unittest,相当于是一个python版的junit. 一.unittest简介 1.先导入unit ...
随机推荐
- 洛谷P4172 [WC2006]水管局长(lct求动态最小生成树)
SC省MY市有着庞大的地下水管网络,嘟嘟是MY市的水管局长(就是管水管的啦),嘟嘟作为水管局长的工作就是:每天供水公司可能要将一定量的水从x处送往y处,嘟嘟需要为供水公司找到一条从A至B的水管的路径, ...
- 修改阿里云ECS服务器的系统时区
1.前提 由于公司有在印尼的项目,所以购买了阿里云在新加坡机房的服务器(在印尼还没有),印尼当地使用的是东七区的时间,所以领导要求修改阿里云ECS系统的时区. 2.动手 修改阿里云ECS服务器系统的时 ...
- mysql数据库使用sql查询数据库大小及表大小
网上查了很多资料,最后发现一个可行的,分享如下: 数据库大小查询: select concat(round(sum(DATA_LENGTH/1024/1024),2),'M') from inform ...
- 7个常见Javascript框架介绍
设计开发中的“框架”指一套包含工具.函数库.约定,以及尝试从常用任务中抽象出可以复用的通用模块,目标是使设计师和开发人员把重点放在任务项目所特有的方面,避免重复开发.通俗的讲,框架就是最常用的java ...
- RobotFramework与Jenkins集成后构建成功率高于设置阈值但总是显示失败
摘要:robot执行后总是失败 1.在配置jenkins的job时,添加构建步骤Execute Windows batch command,输入执行robotframework测试用例命令 2.然后j ...
- C# 数字转换成汉字大写 数值转换成汉字大写
1.数字转换成汉字大写 public string NumToChinese(string x) { //数字转换为中文后的数组 //转载请注明来自 http://www.shang11.com st ...
- Nagios+InfluxDB+Grafana
1. 概述 Nagios负责收集数据,是一款开源的免费网络监视工具. influxDB负责存储数据,是一个开源的时间序列数据库.比较适合存储监控或者部署记录这些时序数据. Grafana负责数据的图形 ...
- asp.net(mvc) 框架
1.NFine mvc+ef 2.Grove orm架构 3.NHibernate orm 4.NBear 5.petshop 6.Membership 7.Brnshop 网上商城 8.cms快速开 ...
- 点击隐藏显示和点击body空白处隐藏
<!DOCTYPE html> <html lang="en"> <head> <meta charset="UTF-8&quo ...
- Linux centos 6.4安装
Linux系统安装: 开启虚拟机: 界面说明:Install or upgrade an existing system 安装或升级现有的系统install system with basic vid ...