出现问题原因:

vscode运行前端项目输入npm run dev命令触发此错误

解决办法:

指定淘宝镜像安装node-sass

win+r 打开cmd控制台输入

npm install -g cnpm --registry=https://registry.npm.taobao.org

安装成功后运行

cnpm install node-sass 或 cnpm install node-sass@latest

安装完成,查看cnpm

两个都下载成功后就可以正常的运行项目了

附录

npm关于node-sass提供的方法

以上就是Syntax Error: Error: Cannot find module 'node-sass'的介绍,做此记录,如有帮助,欢迎点赞关注收藏!

Syntax Error: Error: Cannot find module ‘node-sass‘的更多相关文章

  1. 【Problem】前端项目运行:Module build failed:Error Node Sass does not yet support my current environmen

    我在运行renren-fast-vue前端项目时,安装完依赖cnpm install 启动服务npm run dev 出现问题. Module build failed: Error: Node Sa ...

  2. vue项目运行报错:Module bulid failed: Error: Node Sass does not yet support your current environment

    出错起因:      从GitLab clone项目 --> 用 npm install 命令下载依赖包 --> #npm run dev,报错 错误截图: 解决方法:   思路:单独 i ...

  3. Error: Node Sass does not yet support your current environment: Windows 64-bit with Unsupported runtime (64)

    错误提示: Error: Node Sass does not yet support your current environment: Windows 64-bit with Unsupporte ...

  4. 怎么解决ERROR in Node Sass does not yet support your current environmen问题?

    好久没有重新安装node.js,昨天和小伙伴们一起安装,由于自己是在网上自行下载的node,安装地比较顺利,但另外两个小伙伴用的共享文件夹里自带的node,却是屡次碰到问题,快被逼疯,在运行Vue时总 ...

  5. rsync @ERROR: auth failed on module backup 解决思路及附录rsync常见问题及解决办法

    昨晚小版本上线,使用rsync往服务器上传文件时,client报如下异常: @ERROR: auth failed on module backup rsync error: error starti ...

  6. srync:@ERROR: auth failed on module tee 的解决办法分析

    首先:检查server端和client端的用户名和密码确认都无误: 然后:检查了服务器端/etc/rsyncd.conf 配置文件未发现异常, 再次:通过配置文件找到了log存放目录 $ cat /e ...

  7. RSYNC @ERROR: AUTH FAILED ON MODULE XXX 解决思路及附录RSYNC常见问题及解决办法

    使用rsync往服务器上传文件时,client报如下异常: @ERROR: auth failed on module XXX rsync error: error starting client-s ...

  8. Entrypoint undefined = index.html html-webpack-plugin 错误ERROR in Error: Child compilation failed: Module build failed (from ./node_modules/html-webpack-plu SyntaxError: Unexpected token )

    Entrypoint undefined = index.html html-webpack-plugin 错误 ERROR in Error: Child compilation failed: M ...

  9. Error: unable to connect to node rabbit@mail: nodedown

    某天,开启一个应用时,发现连接rabbitmq失败,本来想用rabbitmqctl来查看队列,结果提示“Error: unable to connect to node rabbit@mail: no ...

  10. RabbitMQ安装后不能运行 Error: unable to connect to node nodedown

    本地安装RabbitMQ后总是不能正常的使用.. 命令行输入 rabbitMQctl Status  报下边的错 Error: unable to connect to node 'rabbit@YO ...

随机推荐

  1. hyperworks2021位安装教程

    hyperworks2021位安装教程:1.先使用"百度网盘客户端"下载hw21_EN_x64软件安装包到电脑磁盘英文路径文件夹下,并鼠标右击进行解压缩,然后在文件夹内找到hwDe ...

  2. windows安装wsl,在windows中使用ubuntu

    WSL(Windows Subsystem for Linux)即适用于 Linux 的 Windows 子系统,它是随 Windows 操作系统一起提供. WSL是windows操作系统的子系统,算 ...

  3. 记一次 .NET 某自动化集采软件 崩溃分析

    一:背景 1.讲故事 前段时间有位朋友找到我,说他的程序在客户的机器上跑着跑着会出现偶发卡死,然后就崩掉了,但在本地怎么也没复现,dump也抓到了,让我帮忙看下到底怎么回事,其实崩溃类的dump也有简 ...

  4. python3的可迭代对象与迭代器对象

    可迭代对象与迭代器对象 通过一段简单的代码来理解这俩个概念 a = [1,2,3,4] for i in a: print(i) 这段代码很简单, 对 a 这个列表进行遍历, 然后打印输出每个元素, ...

  5. GO开发工具litelDE的安装与使用

    1.MinGW的下载与安装 地址:http://sourceforge.net/projects/mingw/ 下载安装 D:\Program Files\MinGW 然后打开D:\Program F ...

  6. java 运用jxl 读取和输出Excel

    文章结尾源码以及jxl包 1.输出excel: package JmExcel; import java.io.File; import java.io.FileOutputStream; impor ...

  7. JDK卸载

    JDK卸载 从环境变量里的JAVA_HOME里找到jdk的主程序,删掉 把JAVA_HOME删掉,在把path里跟java_home相关的也删掉 在cmd里运行java-version

  8. C#-将进程注册为子进程,父进程崩溃的时候子进程也随之退出的方案和实例

    C#-将进程注册为子进程,父进程崩溃的时候子进程也随之退出的方案和实例 Kill child process when parent process is killed 我正在使用我的应用程序中的Sy ...

  9. Go DevOps大厂运维平台开发进阶实战营

    使用 Jenkinsfile 创建流水线已报名老男孩运维课,见底下评论.enkinsfile 是一个文本文件,它包含 Jenkins 流水线的定义,并被检入源代码控制仓库.Jenkinsfile 将整 ...

  10. 【机器学习】李宏毅——卷积神经网络CNN

    CNN我们可以从两个角度来理解其中的具体过程 Neuron Version Story(解释版本1) 对于图像分类,其具体的流程如下所示: 将一张图像作为模型的输入,输出经过softmax之后将与理想 ...