hudson 使用节点打包出现ClassNotFoundException: org.jvnet.hudson.maven3.agent.Maven3Main 错误
java.lang.NoClassDefFoundError: org/jvnet/hudson/maven3/agent/Maven3Main
Caused by: java.lang.ClassNotFoundException: org.jvnet.hudson.maven3.agent.Maven3Main
at java.net.URLClassLoader$1.run(Unknown Source)
at java.security.AccessController.doPrivileged(Native Method)
at java.net.URLClassLoader.findClass(Unknown Source)
at java.lang.ClassLoader.loadClass(Unknown Source)
at sun.misc.Launcher$AppClassLoader.loadClass(Unknown Source)
at java.lang.ClassLoader.loadClass(Unknown Source)
Could not find the main class: org.jvnet.hudson.maven3.agent.Maven3Main. Program will exit.
ERROR: Failed to launch Maven. Exit code = 1
错误如上,把节点断开重连可以暂时解决这个问题,如需完全解决需要保证master机器和slave机器上的jdk版本一致。
详见 http://stackoverflow.com/questions/11556404/jenkins-build-error-java-lang-classnotfoundexception-hudson-remoting-launcher
hudson 使用节点打包出现ClassNotFoundException: org.jvnet.hudson.maven3.agent.Maven3Main 错误的更多相关文章
- vs2010打包系统必备选择.net framework 3.5sp1编译错误的解决方法
利用visual studio 2010进行打包程序,默认安装的是Framework 4.0,如果需要将3.5sp1打包到系统中一起安装(选择了"从与我的应用程序相同的位置下载系统必备组件& ...
- Unity打包提示UnityEditor.BuildPlayerWindow+BuildMethodException: Build failed with errors.错误
不要将打包的输出路径设置为Assets文件夹下面即可,MD真坑 老外给出的解释: As you have noticed after you click build settings you are ...
- Vue项目build打包部署到Tomcat后,刷新报404错误解决方案
问题描述: 一.更新依赖,并打包项目 cd /root/.jenkins/workspace/v-test;npm installcd /root/.jenkins/workspace/v-test; ...
- vue打包后出现"Failed to load resource: net::ERR_FILE_NOT_FOUND"错误
创建vue脚手架搭建项目之后,用npm run build经行打包,运行index.html后出现异常: 打开dist/index.html, 诸如这些的,引入是有问题的, 这边的全部是绝对路径,而本 ...
- InnoSetup打包时出现Interal error: CallSpawnServer: Unexpected response: $0.错误的解决办法
如果在使用Innosetup打包软件时,如果出现Interal error: CallSpawnServer: Unexpected response: $0.错误, 如下图: 可以查看 Innose ...
- vue webpack打包后.css文件里面的背景图片路径错误解决方法
资源相对引用路径 问题描述 一般情况下,通过webpack+vuecli默认打包的css.js等资源,路径都是绝对的. 但当部署到带有文件夹的项目中,这种绝对路径就会出现问题,因为把配置的static ...
- Vue打包后放到服务器出现Loading chunk {n} failed 错误
导航栏点击切换时 会出现Loading chunk {n} failed ,刷新之后便不会出现.而且n在最新的build的文件中,n没有存在 偶然一次发现,项目更新迭代开发时上传测试环境后就会出现, ...
- C# 读取app.config配置文件 节点键值,提示 "配置系统未能初始化" 错误的解决方案
新建C#项目,在app.config中添加了appSettings项,运行时出现"配置系统未能初始化"的错误,MSDN里写到,如果配置文件中包含 configSections 元素 ...
- python打包成.exe工具py2exe0-----No such file or directory错误
转自:http://justcoding.iteye.com/blog/900993 一.简介 py2exe是一个将python脚本转换成windows上的可独立执行的可执行程序(*.exe)的工具, ...
随机推荐
- C++比起C来新增的拓展
命名空间 register 在C语言横行的时代,为了加快运行速度,一些关键变量会被放入寄存器中,程序代码请求编译器把变量存入寄存器,然而C语言版的寄存器变量无法通过地址获得register变量.c++ ...
- google搜索设置,在新的窗口打开
- Appium 基于控件左滑操作
def swipe_ele_left(self, ele, dur=800): """ 基于控件元素左滑操作 :param ele: 控件元素 :param dur: 在 ...
- 去掉右键Open Folderas Intellij IDEA Project
解决: WIN+R键打开运行,输入regedit 打开注册表 在地址栏输入: 计算机\HKEY_CLASSES_ROOT\Directory\Background\shell\Powershell 然 ...
- HTML札记
HTML 指的是 超文本标记语言 (Hyper Text Markup Language) 文档后缀名: 当您保存 HTML 文件时,既可以使用 .htm 也可以使用 .html 扩展名.两者没有区别 ...
- C++Primer 5th Chap6 Functions
局部静态变量,关键字static修饰,即使函数结束执行也不受影响,生存期直到程序终止. java中static的单一存储空间的概念与其或有异曲同工之妙. 函数的形参可以无名,但有名可以使其意义更加清晰 ...
- docker 实践四:仓库管理
本篇我们来了解 docker 仓库的内容. 注:环境为 CentOS7,docker 19.03 仓库(Responsitory)是集中存放镜像的地方,又分公共仓库和私有仓库. 注:有时候容易把仓库与 ...
- Solr介绍 入门练习
1.1 Solr是什么 Solr是一个基于全文检索的企业级应用服务器. 全文检索:可以输入一段文字,通过分词检索数据!!(复习) 应用服务器:它是单独的服务. 1.2 Solr能做什么 它就是用于做全 ...
- tuxedo10g3R的安装过程(原文url:http://www.cnblogs.com/xianfish/articles/1955244.html)
RHEL 5.1 32Bit 安装配置TUXEDO 10R3 [前言]: 目的: 在Linux上安装配置Tuxedo 10R3 环境: RHEL 5.1 32Bit [前提条件]: 下载Tuxed ...
- BZOJ4698 SDOI2008Sandy的卡片(后缀自动机)
差分后即求多串LCS.先考虑两个串怎么做.对第一个串建SAM,第二个串在上面跑即可,任意时刻走到的节点表示的都是第二个串的当前前缀在第一个串中出现的最长的后缀,具体计算长度时每走一个字符长度+1,跳f ...