运行python train.py --logtostderr --train_dir=training/ --pipeline_config_path=training/ssd_mobilenet_v1_coco.config出现google.protobuf.text_format.ParseError: 166:8 : Message type "object_detection.protos.RandomHorizontalFlip" has no field named "i".错误。

解决方法

查看training文件夹下的ssd_mobilenet_v1_coco.config文件,查找一下i这个字母,看看有没有什么出错的地方。

参考

https://github.com/tensorflow/models/issues/4905

报错google.protobuf.text_format.ParseError: 166:8 : Message type "object_detection.protos.RandomHorizontalFlip" has no field named "i".解决方法的更多相关文章

  1. [问题]编译报错:clang: error: linker command failed with exit code 1及duplicate symbol xxxx in错误解决方法之一

    今天添加了一个新类(包括m,h,xib文件),还没有调用,-编译遇到如下错误,根据错误提示, duplicate symbol param1 in: /Users/xxxx/Library/Devel ...

  2. [报错]编译报错:clang: error: linker command failed with exit code 1及duplicate symbol xxxx in错误解决方法之一

    今天添加了一个新类(包括m,h,xib文件),还没有调用,—编译遇到如下错误,根据错误提示, duplicate symbol param1 in: /Users/xxxx/Library/Devel ...

  3. oracle安装报错[INS-30131]执行安装程序验证所需的初始设置失败(无法访问临时位置)解决方法!

    最近在电脑上安装oracle12c,安装时,在执行检查环境步骤时候报错: [INS-30131]执行安装程序验证所需的初始设置失败(无法访问临时位置) 最后在网上搜索解决方法,特记录下,以防以后再用到 ...

  4. Python报错 ImportError: DLL load failed while importing win32api: %1 不是有效的 Win32 应用程序 的解决方法

    今天在用jupyter notebook 的时候发生了kernel error,点开之后提示了以下报错信息 Traceback (most recent call last): File " ...

  5. notification 报错the method build() is undefined for the type Notificatin.Builder

    notification 报错the method build() is undefined for the type Notificatin.Builder 这事api版本号太低导致的 Notifi ...

  6. selenium的报错信息:selenium.common.exceptions.InvalidSelectorException: Message: invalid selector: Compound class names not permitted

    报错信息:selenium.common.exceptions.InvalidSelectorException: Message: invalid selector: Compound class ...

  7. 【PHP】php7.2报错The each() function is deprecated. This message will be suppressed on furthe

    php7.2以上 废除了 each()方法,项目中用到的地方会出现以下报错 The each() function is deprecated. This message will be suppre ...

  8. 【JUnit】@Test 报错,"Test cannot be resolved to a type"

    想用单元测试 JUnit 单元测试下写好的方法,发现写 @Test 标签报错了,"Test cannot be resolved to a type" 原来是项目没有导入 JUni ...

  9. Python3中使用HTMLTestRunner报No module named 'StringIO'解决方法

    今天在学习使用HTMLTestRunner生成测试报告时遇到一个报错,如图所示: 网上搜索了下“No module named 'StringIO'”解决方法,原来我用的是Python 3.X版本,而 ...

随机推荐

  1. 2020年一线大厂月薪35K的Python开发要求

    为什么程序员要在2020年学习Python? 如果你正在考虑学习 Python,但又不确定为什么要这样做的话,那么你可以看看以下的内容: 马蜂窝裁员竟然达到了40%, 前段时间猪厂.菊厂裁员被推到了风 ...

  2. input输入框type设置为number,maxlength无效

    一个小细节,以前很少注意,直到最近做的一个项目,当我把一个输入数字的input框的类型设置为number时,input框还是可以无限输入,设置maxlengh=10就不起作用了.然后我就去百度了一下, ...

  3. pip配置永久国内源

    1.windows配置方式: (1)打开文件资源管理器 --------在地址栏中输入 %appdata% (2)手动创建一个文件夹叫做 pip (3)在pip的文件夹里面新建一个文件 pip.ini ...

  4. 使用Vue时localhost:8080中localhost换成ip地址后无法显示页面的问题

    解决办法是:在package.json中 然后重新启动服务器 npm run dev 就正常显示了.

  5. jdk动态代理和cglib动态代理底层实现原理详细解析(cglib动态代理篇)

    代理模式是一种很常见的模式,本文主要分析cglib动态代理的过程 1. 举例 使用cglib代理需要引入两个包,maven的话包引入如下 <!-- https://mvnrepository.c ...

  6. 深度学习之父低调开源 CapsNet,欲取代 CNN

    “卷积神经网络(CNN)的时代已经过去了!” ——Geoffrey Hinton 酝酿许久,深度学习之父Geoffrey Hinton在10月份发表了备受瞩目的Capsule Networks(Cap ...

  7. 大道至简第一章JAVA伪代码形式读后感

    //愚公移山: public class YuGongYiShan{ //原始需求:“惩山北之塞,出入之迂” //沟通方式:“聚室而谋曰” //项目目标:“毕力平险,指通豫南,达于汉阴” //技术方案 ...

  8. Copy-On-Write容器(转载)

    Copy-On-Write简称COW,是一种用于程序设计中的优化策略.其基本思路是,从一开始大家都在共享同一个内容,当某个人想要修改这个内容的时候,才会真正把内容Copy出去形成一个新的内容然后再改, ...

  9. Linux Mysql基础操作

    1). 打开MySQL 使用如下两条命令,打开MySQL服务并使用root用户登录: # 启动 MySQL 服务 sudo service mysql start # 使用 root 用户登录,实验楼 ...

  10. python中的拷贝

    再说拷贝之前先说一说 is 与 == is 的作用是 比较两个引用是否为一个地址 == 是比较两个值 对变量 a  变量 b  都赋值为 2 : a 与 b 的值相等我们都可以理解,但是a与b引用地址 ...