standaloneSetup(clrr).
build();

执行第二行 build() 时,出现下面的错误提示。

java.lang.NoClassDefFoundError: javax/servlet/SessionCookieConfig
at org.springframework.test.web.servlet.setup.StandaloneMockMvcBuilder.initWebAppContext(StandaloneMockMvcBuilder.java:329)
at org.springframework.test.web.servlet.setup.AbstractMockMvcBuilder.build(AbstractMockMvcBuilder.java:127)
at com.tony.springTest.HomeControllerTest.testHomeP(HomeControllerTest.java:34)
at sun.reflect.NativeMethodAccessorImpl.invoke0(Native Method)
at sun.reflect.NativeMethodAccessorImpl.invoke(NativeMethodAccessorImpl.java:39)
at sun.reflect.DelegatingMethodAccessorImpl.invoke(DelegatingMethodAccessorImpl.java:25)
at java.lang.reflect.Method.invoke(Method.java:597)
at org.junit.runners.model.FrameworkMethod$1.runReflectiveCall(FrameworkMethod.java:44)
at org.junit.internal.runners.model.ReflectiveCallable.run(ReflectiveCallable.java:15)
at org.junit.runners.model.FrameworkMethod.invokeExplosively(FrameworkMethod.java:41)
at org.junit.internal.runners.statements.InvokeMethod.evaluate(InvokeMethod.java:20)
at org.junit.runners.BlockJUnit4ClassRunner.runChild(BlockJUnit4ClassRunner.java:76)
at org.junit.runners.BlockJUnit4ClassRunner.runChild(BlockJUnit4ClassRunner.java:50)
at org.junit.runners.ParentRunner$3.run(ParentRunner.java:193)
at org.junit.runners.ParentRunner$1.schedule(ParentRunner.java:52)
at org.junit.runners.ParentRunner.runChildren(ParentRunner.java:191)
at org.junit.runners.ParentRunner.access$000(ParentRunner.java:42)
at org.junit.runners.ParentRunner$2.evaluate(ParentRunner.java:184)
at org.junit.runners.ParentRunner.run(ParentRunner.java:236)
at org.eclipse.jdt.internal.junit4.runner.JUnit4TestReference.run(JUnit4TestReference.java:86)
at org.eclipse.jdt.internal.junit.runner.TestExecution.run(TestExecution.java:38)
at org.eclipse.jdt.internal.junit.runner.RemoteTestRunner.runTests(RemoteTestRunner.java:459)
at org.eclipse.jdt.internal.junit.runner.RemoteTestRunner.runTests(RemoteTestRunner.java:675)
at org.eclipse.jdt.internal.junit.runner.RemoteTestRunner.run(RemoteTestRunner.java:382)
at org.eclipse.jdt.internal.junit.runner.RemoteTestRunner.main(RemoteTestRunner.java:192)
Caused by: java.lang.ClassNotFoundException: javax.servlet.SessionCookieConfig
at java.net.URLClassLoader$1.run(URLClassLoader.java:202)
at java.security.AccessController.doPrivileged(Native Method)
at java.net.URLClassLoader.findClass(URLClassLoader.java:190)
at java.lang.ClassLoader.loadClass(ClassLoader.java:306)
at sun.misc.Launcher$AppClassLoader.loadClass(Launcher.java:301)
at java.lang.ClassLoader.loadClass(ClassLoader.java:247)
... 25 more

在 debug 模式下,可以知道 standaloneSetup(clrr) 得到的是 StandaloneMockMvcBuilder 对象和 exception 中报异常的类名一致。

在 Cannot create MockHttpSession with servlet 2.x, spring得到下面有用提示:Spring 4.0 需要得到 servlet 3.0 或以上版本的支持。

The Servlet API mocks in Spring Framework 4.0 support Servlet 3.0 and higher, as can be seen inGitHub commit deba32cad9.

追踪上面的 github 链接,可以发现 SessionCookieConfig 是在升级 servlet API 到 3.0 变动中新增的。

在查询SessionCookieConfig 文档,可以知道 SessionCookieConfig 是在 servlet 3.0 才引入的。

反观自己项目 pom.xml ,用的是 servlet 2.5 ,可以判断得到,是自己项目引用的 servlet 版本过低导致的,需要升级到 3.0 或以上。

        <!-- Servlet -->
<dependency>
<groupId>javax.servlet</groupId>
<artifactId>servlet-api</artifactId>
<version>2.5</version>
<scope>provided</scope>
</dependency>

变动 1 如下。

        <!-- Servlet -->
<dependency>
<groupId>javax.servlet</groupId>
<artifactId>servlet-api</artifactId>
<version>3.0.1</version>
<scope>provided</scope>
</dependency>

改动后,出现了新的两个错误 :

Missing artifact javax.servlet:servlet-api:jar: 3.0.1
Description    Resource    Path    Location    Type
The superclass "javax.servlet.http.HttpServlet" was not found on the Java Build Path home.jsp /SpringTest/src/main/webapp/WEB-INF/views line 1 JSP Problem
The superclass "javax.servlet.http.HttpServlet" was not found on the Java Build Path reg.jsp /SpringTest/src/main/webapp/WEB-INF/views line 1 JSP Problem
The superclass "javax.servlet.http.HttpServlet" was not found on the Java Build Path regSucess.jsp /SpringTest/src/main/webapp/WEB-INF/views line 1 JSP Problem
The superclass "javax.servlet.http.HttpServlet" was not found on the Java Build Path spittles.jsp /SpringTest/src/main/webapp/WEB-INF/views line 1 JSP Problem
HttpServlet 找不到是很不合理的,第一个错误表示无法找到 3.0.1 版本的 servlet 。

项目依赖是用 maven 管理的,通过 mvn clean,尝试解决无法找到 3.0.1 servlet artifact 问题。命令如下:
$ cd {project folder}
$ mvn clean compile

但是出现了新的错误:

[INFO] ------------------------------------------------------------------------
[ERROR] Failed to execute goal on project springTest: Could not resolve dependencies for project com.tony:springTest:war:1.0.-BUILD-SNAPSHOT: Failure to find javax.servlet:servlet-api:jar:3.0. in https://repo.maven.apache.org/maven2/ was cached in the local repository, resolution will not be reattempted until the update interval of maven.dev.snaponglobal.com has elapsed or updates are forced -> [Help 1]

错误提示 maven repository 无法找到需要的 3.0.1 servlet 。在 repository URL : https://repo.maven.apache.org/ 下面一级一级找,确实没有 servlet 3.0.1 版本的 artifiact 。那么就需要给 maven 换一个有 3.0.1 servlet 的 repository 或者 mirror 。

在网上找到一个有效的 servlet 3.0.1 : http://repo1.maven.org/maven2/javax/servlet/javax.servlet-api/。

于是在 ~/.m2/setting.xml 中将 maven 的 mirror 改为 repo1 的 。如下:

    <mirrors>
<mirror>
<id>maven.dev.snaponglobal.com</id>
<name>Internal Artifactory Maven repository</name>
<url>http://repo1.maven.org/maven2/</url>
<mirrorOf>*</mirrorOf>
</mirror>
</mirrors>

修改好 mirror 后,还是提示无法解决依赖的 3.0.1 servlet :

Downloading: http://repo1.maven.org/maven2/javax/servlet/servlet-api/3.0.1/servlet-api-3.0.1.jar
[INFO] ------------------------------------------------------------------------
[INFO] BUILD FAILURE
[INFO] ------------------------------------------------------------------------
[INFO] Total time: 4.511 s
[INFO] Finished at: --09T00::+:
[INFO] Final Memory: 11M/245M
[INFO] ------------------------------------------------------------------------
[ERROR] Failed to execute goal on project springTest: Could not resolve dependencies for project com.tony:springTest:war:1.0.-BUILD-SNAPSHOT: Could not find artifact javax.servlet:servlet-api:jar:3.0. in maven.dev.snaponglobal.com (http://repo1.maven.org/maven2/) -> [Help 1]

通过仔细对比错误提示的 URL 和 浏览器的 URL ,发现路径有点不一样。

错误提示的是 /servlet/servlet-api/ ,而浏览器的实际路径为 /servlet/javax.servlet-api/ ,将 pom.xml 中的 artifactId 纠正过来就好了。纠正后配置如下 :

        <!-- Servlet -->
<dependency>
<groupId>javax.servlet</groupId>
<artifactId>javax.servlet-api</artifactId>
<version>3.0.1</version>
<scope>provided</scope>
</dependency>

重新运行 mvn clean 后,可以成功下载 3.0.1 servlet 。然后运行 Spring 的 unit test 也没也报错。

问题解决完毕。

Spring 4.0 StandaloneMockMvcBuilder java.lang.NoClassDefFoundError: javax/servlet/SessionCookieConfig 问题解决的更多相关文章

  1. Spring boot ---- java.lang.NoClassDefFoundError: javax/servlet/ServletContext

    Spring boot ---- java.lang.NoClassDefFoundError: javax/servlet/ServletContext   场景描述 项目中用到spring boo ...

  2. 【异常】idea执行Main方法出现 Exception in thread "main" java.lang.NoClassDefFoundError: javax/servlet/http/HttpServletRequest

    一.异常复现步骤 1)首先得是一个Spring MVC项目 注:Spring Boot项目有内置的web 容器,不会出现该问题 2)main方法存在于使用HttpServletRequest类的类中 ...

  3. java.lang.NoClassDefFoundError: javax/servlet/ServletContext

    方法1:把SpringBoot中main方法所在的class不再继承org.springframework.boot.context.web.SpringBootServletInitializer即 ...

  4. java.lang.NoClassDefFoundError: javax/servlet/AsyncContext

    报错:java.lang.NoClassDefFoundError: javax/servlet/AsyncContext 我认为你需要在Servlet API,而不是2.5.AsyncContext ...

  5. java.lang.NoClassDefFoundError: javax/servlet/AsyncListener解决方案

    问题:spring3.2的架构在tomcat6.0中无法正常启动,抛出java.lang.NoClassDefFoundError: javax/servlet/AsyncListener错误 原因: ...

  6. java.lang.NoClassDefFoundError: javax/servlet/jsp/jstl/core/Config

    今天写SpringMvc时,遇到这样一个问题: java.lang.NoClassDefFoundError: javax/servlet/jsp/jstl/core/Config at org.sp ...

  7. Handler processing failed; nested exception is java.lang.NoClassDefFoundError: javax/servlet/jsp/jstl/core/Config解决

    出现这个问题往往伴随  HTTP-500错误 报错信息: HTTP Status - Handler processing failed; nested exception is java.lang. ...

  8. HTTP Status 500 - javax.servlet.ServletException: java.lang.NoClassDefFoundError: javax/servlet/jsp/jstl/core/LoopTag

    我在项目中导入了jar,还是不能使用EL表达式,一运行就出现了下面的额错误: org.apache.jasper.JasperException: javax.servlet.ServletExcep ...

  9. java.lang.NoClassDefFoundError: javax/el/ELResolver 问题解决

    HTTP Status 500 - java.lang.NoClassDefFoundError: javax/el/ELResolver type Exception report message ...

随机推荐

  1. Java基础知识强化之IO流笔记14:递归之输出指定目录下所有java文件绝对路径的案例

    1. 需求:输出指定目录下的所以.java结尾文件的绝对路径的案例:  分析:  A:封装目录  B:获取该目录下的所有文件和文件夹的File数组  C:遍历这个File数组,得到每一个File对象的 ...

  2. Android(java)学习笔记229:服务(service)之绑定服务调用服务里面的方法 (采用接口隐藏代码内部实现)

    1.接口 接口可以隐藏代码内部的细节,只暴露程序员想暴露的方法 2.利用上面的思想优化之前的案例:服务(service)之绑定服务调用服务里面的方法,如下: (1)这里MainActivity.jav ...

  3. Day7 - Python基础7 面向对象编程进阶

    Python之路,Day7 - 面向对象编程进阶   本节内容: 面向对象高级语法部分 经典类vs新式类 静态方法.类方法.属性方法 类的特殊方法 反射 异常处理 Socket开发基础 作业:开发一个 ...

  4. 转载:C# 之泛型详解

    本文原地址:http://www.blogjava.net/Jack2007/archive/2008/05/05/198566.html.感谢博主分享! 什么是泛型 我们在编写程序时,经常遇到两个模 ...

  5. ASP.NET-FineUI开发实践-14

    以前写过一个表格自动补全,改下,就出现了部分级联修改.测试版本4.1.1 共享下JS,ext-part2.js       后台再来个得到数据的方法就可以了.   1.方法还是删除+插入,主要在  i ...

  6. 重装系统时,将MBR分区转为GPT 分区

    摘要 很多同学在重装系统的时候,或多或少都遇到过这样的问题:镜像文件没有问题,软碟通刻录也没有问题,但偏偏就在选择安装系统盘盘符的时候,跳出对话框,提示:Windows无法安装到这个磁盘,选中的磁盘具 ...

  7. js星级评分点击星级评论打分效果--收藏--转载

    <!DOCTYPE html PUBLIC "-//W3C//DTD XHTML 1.0 Transitional//EN" "http://www.w3.org/ ...

  8. java编程思想-注解思维导图

  9. log4net编译后命名空间找不到的问题

    log4net编译后命名空间找不到的问题问题:工程A添加dll引用后,可以在代码中引入log4net的命名空间.工程B引用A.A能编译成功,B不能编译成功,提示找不到命名空间. 解决: 点击项目属性- ...

  10. TCP状态转换图

    注意: connect函数导致当前套接字从CLOSE状态(该套接字自从由socket函数创建以来一直所处的状态)转移到SYN_SENT状态 若成功则再转移到ESTABLISHED状态, 若connec ...