升级到C++Builder RAD 10 Settle 一些错误解决方法,使用LLVM  CLang编译器,BCC32C

http://docwiki.embarcadero.com/RADStudio/Seattle/en/Stricter_C%2B%2B_Compilers_%28Clang-based_C%2B%2B_Compilers%29#Two-Phase_Name_Lookup_in_Templates

Brush->Color = RGB(49, 106, 197);

TColor cc= 0x333;

clang and c++11 Stricter。

[CLANG Error] ***.cpp(1993): cannot initialize a parameter of type 'System::Uitypes::TColor' with an rvalue of type 'COLORREF' (aka 'unsigned long')
Vcl.Graphics.hpp(390): passing argument to parameter 'Value' here

fix》(TColor)

(TColor)

Brush->Color =(TColor) RGB(49, 106, 197);

TColor cc= (TColor)0x333;

String().sprintf(TEXT("SUM(%s)"), fn);

[CLANG Error] 1.cpp(2156): cannot pass object of non-trivial type 'String' (aka 'System::UnicodeString') through variadic method; call will abort at runtime

fix》c_str()

.c_str()

String ft, fn;
String().sprintf(L"%s %s;", ft.c_str(), fn.c_str());

so like this ok?

String().sprintf(_D("%s"), _D("Hello"));

TParam *pParam, Variant val

pParam->AsBoolean = (bool)val;

[CLANG Error] tt.cpp(2237): ambiguous conversion for C-style cast from 'System::Variant' to 'bool'

fix:

pParam->AsBoolean = val.VBoolean;

 PtInRect Bound

[CLANG Error] WndSpy.cpp(86): taking the address of a temporary object of type 'System::Types::TRect'

PtInRect(&BoundsRect, MousePoint) && hWindow != hOldWindow)

fix》》

TRect arect=BoundsRect;
PtInRect(&arect, MousePoint) && hWindow != hOldWindow)

 BCBSMP.LIB|cspin

[ilink32 Error] Error: Unresolved external '__InitExceptBlockLDTC' referenced from D:\PROGRAM FILES (X86)\EMBARCADERO\STUDIO\17.0\LIB\WIN32\RELEASE\BCBSMP.LIB|cspin
[ilink32 Error] Error: Unresolved external '__Return_unwind' referenced from D:\PROGRAM FILES (X86)\EMBARCADERO\STUDIO\17.0\LIB\WIN32\RELEASE\BCBSMP.LIB|cspin
[ilink32 Error] Error: Unresolved external '_CatchCleanup()' referenced from D:\PROGRAM FILES (X86)\EMBARCADERO\STUDIO\17.0\LIB\WIN32\RELEASE\BCBSMP.LIB|cspin
[ilink32 Error] Error: Unresolved external '_ReThrowException(unsigned int, unsigned char *)' referenced from D:\PROGRAM FILES (X86)\EMBARCADERO\STUDIO\17.0\LIB\WIN32\RELEASE\BCBSMP.LIB|cspin
[ilink32 Error] Error: Unresolved external '_ThrowExceptionLDTC(void *, void *, void *, void *, unsigned int, unsigned int, unsigned int, unsigned char *, void *)' referenced from D:\PROGRAM FILES (X86)\EMBARCADERO\STUDIO\17.0\LIB\WIN32\RELEASE\BCBSMP.LIB|cgauges

seh_personality_v0

[ilink32 Error] Error: Unresolved external '___seh_personality_v0' referenced from tt.OBJ
[ilink32 Error] Error: Unresolved external '__Unwind_SjLj_Register' referenced from tt.OBJ
[ilink32 Error] Error: Unresolved external '__Unwind_SjLj_Unregister' referenced from D:\PROGRAM FILES (X86)\EMBARCADERO\STUDIO\17.0\LIB\WIN32\DEBUG\RTLE.LIB|ustring
[ilink32 Error] Error: Unresolved external '___cxa_begin_catch' referenced from tt.OBJ
[ilink32 Error] Error: Unresolved external '___cpp_terminate' referenced from tt.OBJ

http://docwiki.embarcadero.com/RADStudio/Seattle/en/C%2B%2B_Compiler

fix:

用bcc32经典编译器,完整编译OK!

Hide exception variables(-xv) 设置为true试试

cxa_rethrow

[ilink32 Error] Error: Unresolved external '___cxa_rethrow' referenced from tt\AENCRYPT.OBJ
[ilink32 Error] Error: Unresolved external '___cxa_end_catch' referenced from tt\AENCRYPT.OBJ
[ilink32 Error] Error: Unresolved external '__Unwind_Resume' referenced from tt\AENCRYPT.OBJ
[ilink32 Error] Error: Unresolved external '__cxxabiv1::__si_class_type_info::' referenced from tt\AENCRYPT.OBJ
[ilink32 Error] Error: Unresolved external '__cxxabiv1::__class_type_info::' referenced from tt\AENCRYPT.OBJ
[ilink32 Error] Error: Unresolved external '___cxa_free_exception' referenced from tt\AENCRYPT.OBJ
[ilink32 Error] Error: Unresolved external '___cxa_allocate_exception' referenced from tt\AENCRYPT.OBJ
[ilink32 Error] Error: Unresolved external '___cxa_throw' referenced from tt\AENCRYPT.OBJ

std::_Xbad_alloc()

[ilink32 Error] Error: Unresolved external 'std::_Xbad_alloc()' referenced from tt\QRYRESULT.OBJ
[ilink32 Error] Error: Unresolved external 'std::_Xlength_error(const char *)' referenced from tt\QRYRESULT.OBJ

 DoGetGestureOptions

[ilink32 Error] Error: Unresolved external '__fastcall Vcl::Controls::TControl::DoGetGestureOptions(System::Set<Vcl::Controls::TInteractiveGesture, 0, 4>&, System::Set<Vcl::Controls::TInteractiveGestureOption, 0, 4>&)' referenced from tt.OBJ

fix:

use bcc32c no error,but component not install ok!

use bcc32: compiler error DoGetGestureOptions, switch to bcc32c and switch bcc32 compiler ok!! component install ok!@

add cpp and h file

void __fastcall DoGetGestureOptions(TInteractiveGestures &Gestures, TInteractiveGestureOptions &Options);

void __fastcall ttt::DoGetGestureOptions(TInteractiveGestures &Gestures, TInteractiveGestureOptions &Options)
{

}

Unable open  BCBSMP.LIB

Lib Path Add

$(BDSLIB)\win32\release

this->DBGrid1->Options.Contains(Vcl::Dbgrids::dgRowLines);
this->DBGridEh1->Options.Contains(Dbgrideh::dgRowLines);
// this->DBGridEh1->Options.Contains(Gridseh::gdRowSelected);

c++10 Seattle Clang error的更多相关文章

  1. nodejs错误:ld: library not found for -lgcc_s.10.5 clang: error: linker command failed with exit code 1 (use -v to see invocation)

    解决方案: $ cd /usr/local/lib $ sudo ln -s ../../lib/libSystem.B.dylib libgcc_s.10.5.dylib 参考链接

  2. Delphi 10 Seattle Update 1 修复 iOS HTTP 协定需求

    在 iOS 9 Apple 加入了 HTTP 协议,还好有 TMS 提供快速修复工具,得以能顺利上架到 App Store. 现在 Delphi 10 Seattle Update 1 提供了这个设定 ...

  3. bug:clang: error: no input files

    1.clang: error: no input files这个问题一般是因为你删除或者移动了某一个文件,但是在你的编译资源里面( project > target > Build Pha ...

  4. 解决clang: error: no such file or directory: such file or directory:的问题

    一,详细问题描述 clang: error: no such file or directory: 'xxx/src/GGBaCollectionViewCell.m' clang: error: n ...

  5. 【原】xcode5.0升级5.1遇到的clang: error: unknown argument: '-fobj-arc'错误

    XCODE5.0升到XCODE5.1后LLVM也从5.0升到5.1,工程报下面的错误了: clang: error: unknown argument: '-fobj-arc' [-Wunused-c ...

  6. clang: error: no such file or directory: xxx.pch

    今天打开一个下载的例子 报clang: error: no such file or directory: xxx.pch的错 说一下解决方案 1.先在你的工程里找到这.pch文件- 2.把它现在的路 ...

  7. 关于mac安装rails报错clang: error: unknown argument

    文章都是从我的个人博客上转载过来的,大家可以点击我的个人博客. www.iwangzheng.com mac上安装rails的时候报错, 安装rails的在终端执行了一句命令: $sudo gem i ...

  8. clang: error: no such file or directory: 报错

    clang: error: no such file or directory: '/Users/KuaiYong/Desktop/svn/gamebox_v1.2/SettingViewContro ...

  9. clang: error: linker command failed with exit code 1 (use -v to see invocation)

    报错提示: ... ld: 6 duplicate symbols for architecture x86_64 clang: error: linker command failed with e ...

随机推荐

  1. 上下左右布局(DIV+CSS)

    <!DOCTYPE html PUBLIC "-//W3C//DTD XHTML 1.0 Transitional//EN" "http://www.w3.org/ ...

  2. leetcode:Intersection of Two Linked Lists(两个链表的交叉点)

    Write a program to find the node at which the intersection of two singly linked lists begins. For ex ...

  3. Data.gov.uk电子政务云,牛津大学NIE金融大数据实验室王宁:数据治理的现状和实践

    牛津大学NIE金融大数据实验室王宁:数据治理的现状和实践 我是牛津互联网研究院的研究员,是英国开放互联网的一个主要的研究机构和相关政策制订的一个机构.今天主要给大家介绍一下英国数据治理的一些现状和实践 ...

  4. HeadFirst Jsp 05 (属性和监听)

    活用DD, 比如, 我想设置一个email地址, 但是不像在servlet中硬编码, 如果能再web.xml中设置一个参数, 直接拿到这个参数就更好一点. 容器建立一个servlet时, 它会读DD( ...

  5. 8皇后以及N皇后算法探究,回溯算法的JAVA实现,非递归,循环控制及其优化

    上两篇博客 8皇后以及N皇后算法探究,回溯算法的JAVA实现,递归方案 8皇后以及N皇后算法探究,回溯算法的JAVA实现,非递归,数据结构“栈”实现 研究了递归方法实现回溯,解决N皇后问题,下面我们来 ...

  6. networking常用命令

    nc -l 3000 将开一个临时的3000端口并且侦听,用于测试

  7. 听说noip2015有幻方

    终于可以说一句:pascal大法好了 magic.pp是写好的算幻方哦…… 虽然这种水题大家都会,也没什么卵用……

  8. Qt Creator快捷键

    简介 Qt Creator中提供了各种快捷键来加快开发进程. 如果需要查看或自定义快捷键,选择工具->选项->环境->键盘.快捷键按类别列出,可以在过滤器(Filter)处输入命令名 ...

  9. UVa 1149 (贪心) Bin Packing

    首先对物品按重量从小到大排序排序. 因为每个背包最多装两个物品,所以直觉上是最轻的和最重的放一起最节省空间. 考虑最轻的物品i和最重的物品j,如果ij可以放在一个包里那就放在一起. 否则的话,j只能自 ...

  10. 51nod1022 石子归并 V2

    证明w满足四边形不等式,这里w是m的附属量,形如m[i,j]=opt{m[i,k]+m[k,j]+w[i,j]},此时大多要先证明w满足条件才能进一步证明m满足条件证明m满足四边形不等式证明s[i,j ...