maven install:install出现的错误提示】的更多相关文章

maven install:install出现的错误提示 [INFO] --- maven-install-plugin:2.4:install (default-cli) @ maven028 --- [INFO] ------------------------------------------------------------------------ [INFO] BUILD FAILURE [INFO] ----------------------------------------…
运行run as—>maven install时出现以下错误: [ERROR] Failed to execute goal org.apache.maven.plugins:maven-compiler-plugin:2.0.2:compile (default-compile) on project ssh: Compilation failureUnable to locate the Javac Compiler in:  D:/Program Files/MyEclipse 6.0/j…
如果在这时就进行配置安装Mono的话,会在make阶段得到一个“找不到 Microsoft.Portable.Common.targets 文件”的错误提示, 所以需要先进行如下处理: #> cd (mono安装路径的前缀)/mono-3.4.0/mcs/tools/xbuild/targets #> cp Microsoft.Portable.CSharp_4.0.targets Microsoft.Portable.Common.targets #> vim Microsoft.Po…
问题: Maven Clean Install时, 遇到报错package org.junit does not exist 明显, Unit Test在Compile阶段就被检查了. 而POM.xml里面配置的是: <dependency> <groupId>junit</groupId> <artifactId>junit</artifactId> <version>4.12</version> <scope&g…
如果一个项目,你想安装jar包到本地仓库,可能会报The packaging for this project did not assign a file to the build artifact 从这个错误可以延伸出maven 生命周期,插件目标绑定和插件前缀的知识 一.maven生命周期 maven分为clean,default和site3套生命周期,互不影响. 每个生命周期分为不同阶段,后面的阶段依赖于前面的阶段 比如default生命周期的主要阶段:validate,compile ,…
maven进行install的时候,test类里面报错: COMPILATION ERROR : [INFO] ------------------------------------------------------------- [ERROR] /E:/147/cmu/src/test/java/com/migu/reading/stubCmu/NumberSegmentService.java:[22,8] com.migu.reading.stubCmu.NumberSegmentSe…
一.背景 最近的项目在用maven 进行install的时候,发现老师在控制台输出警告:[WARNING] Using platform encoding (UTF-8 actually) to copy filtered resources, i.e. build is platform dependent!虽然并不影响项目的正常运行和install,但是对于处女座的我来说一点都不想看到这警告的发生.所以就研究了一下,找到解决办法,现在分享给大家. 二.解决方式 在maven项目的pom.xm…
Linux使用yum install 安装程序时,提示“另外一个程序锁定了 yum:等待它退出……” 原因: yum命令一次只能安装一个软件,所以当你下载安装第二个软件包时,系统进程锁会锁定yum,这时,关闭进程甚至关闭虚拟机重启再执行yum还是会出现同样情况 解决: 强制采用rm -f /var/run/yum.pid关闭yum进程即可…
关于cocoapods的安装和使用的基本教程: http://my.oschina.net/vimfung/blog/182427?fromerr=j7l3DvCG   出现以下错误提示: Specs satisfying the `IQKeyboardManager (~> 3.3.4)` dependency were found, but they required a higher minimum deployment target.   解决方案:   platform :ios  p…
[已解决]Android Studio错误提示:Gradle project sync failed. Basic functionality (eg. editing, debugging) will not work properly 2015 年 4 月 1 日 下午 9:14crifan已有55221人围观我来说几句 [问题] Android Studio中出现提示: Gradle project sync failed. Basic functionality (eg. editing…