装新的python3.7时ModuleNotFoundError: No module named '_ctypes'
在编译安装新的python3.7的时候
报错 ModuleNotFoundError: No module named '_ctypes',其实是缺少了一个新需要的开发包libffi-devel,安装后即可
yum install libffi-devel -y (包在base)
最终显示
Installing collected packages: setuptools, pip
Successfully installed pip-10.0.1 setuptools-39.0.1
我想在主机上保留原来的py2
所以我需要修改一下原来的python PATH
mv /usr/bin/python /usr/bin/python2
mv /usr/bin/pip /usr/bin/pip2
然后链接编译好的python3的应用程序至/usr/bin/目录
ln -sv /usr/local/python3.7/bin/pip3 /usr/bin/pip
ln -sv /usr/local/python3.7/bin/python3 /usr/bin/python
这样py2和py3就同时在我的主机上了
---------------------
作者:Beeeeeego
来源:CSDN
原文:https://blog.csdn.net/zhangyexinaisurui/article/details/80955986
版权声明:本文为博主原创文章,转载请附上博文链接!
装新的python3.7时ModuleNotFoundError: No module named '_ctypes'的更多相关文章
- centos下安装python3.7.0以上版本时报错ModuleNotFoundError: No module named '_ctypes'
centos下安装python3.7.0以上版本时报错ModuleNotFoundError: No module named '_ctypes'的解决办法 3.7版本需要一个新的包libffi-de ...
- python3.8安装flask出现错误“ModuleNotFoundError: No module named '_ctypes'”
本想在CentOS下配置flask+nginx+uwsgi环境,结果安装最基础的flask包都出了问题...以下是我的环境: 服务器:阿里云ECS CentOS7 python版本:3.8.0 问题描 ...
- [Dynamic Language] Python3.7 源码安装 ModuleNotFoundError: No module named '_ctypes' 解决记录
Python3.7 源码安装 ModuleNotFoundError: No module named '_ctypes' 解决记录 源码安装时报错 File "/home/abeenser ...
- redhat 6安装python 3.7.4报错ModuleNotFoundError: No module named '_ctypes' make: *** [install] Error 1
问题描述: 今天在测试环境中,为了执行脚本,安装下python3命令,在执行make install的时候报错: ModuleNotFoundError: No module named '_ctyp ...
- 报错:ModuleNotFoundError: No module named '_ctypes'
报错背景: CentOS 7 Python3.7 安装 setuptools 插件的时候报错. 报错现象: [root@master setuptools-]# python3. setup.py b ...
- linux 安装python3.7 报错No module named '_ctypes'
ModuleNotFoundError: No module named '_ctypes' 操作系统:centos yum install libffi-devel ./configure --en ...
- CentOS7.5 Python3安装pip报错:ModuleNotFoundError: No module named '_ctypes' --Python3
1.问题:pyhontModuleNotFoundError: No module named '_ctypes' 操作系统:CentOS7.5 安装完Pyhotn3后(如何安装Python3,安装 ...
- 【转载】关于在centos下安装python3.7.0以上版本时报错ModuleNotFoundError: No module named '_ctypes'的解决办法
3.7版本需要一个新的包libffi-devel,安装此包之后再次进行编译安装即可. #yum install libffi-devel -y #make install 原文:https://blo ...
- 关于在centos下安装python3.7.0以上版本时报错ModuleNotFoundError: No module named '_ctypes'的解决办法
3.7版本需要一个新的包libffi-devel,安装此包之后再次进行编译安装即可. #yum install libffi-devel -y#make install若在安装前移除了/usr/bin ...
随机推荐
- postman做接口测试 application/x-www-form-urlencoded 格式与json格式互转
背景:用postman做接口测试可以使用application/x-www-form-urlencoded请求,也可以使用json请求,接口文档如下: 请求参数 字段 类型 是否必填 注释 websi ...
- 【linux基础err】NVIDIA-SMI has failed because it could't communicate with the NVIDIA driver.
问题 安装nvidia driver和cuda关机重启之后出现不能进入系统的问题,进入命令行模式使用nvidia-smi检查驱动的问题. nvidia-smi NVIDIA-SMI has faile ...
- python实践项目六:正则表达式-强口令
描述:写一个函数,它使用正则表达式,确保传入的口令字符串是强口令.强口令的定义是:长度不少于8 个字符, 同时包含大写和小写字符, 至少有一位数字. 代码: #!/usr/bin/python # ...
- Kafka Streams | 流,实时处理和功能
1.目标 在我们之前的Kafka教程中,我们讨论了Kafka中的ZooKeeper.今天,在这个Kafka Streams教程中,我们将学习Kafka中Streams的实际含义.此外,我们将看到Kaf ...
- PAT(B) 1067 试密码(Java)
题目链接:1067 试密码 (20 point(s)) 题目描述 当你试图登录某个系统却忘了密码时,系统一般只会允许你尝试有限多次,当超出允许次数时,账号就会被锁死.本题就请你实现这个小功能. 输入格 ...
- Go语言( 函数)
函数是组织好的.可重复使用的.用于执行指定任务的代码块.本文介绍了Go语言中函数的相关内容. 函数 Go语言中支持函数.匿名函数和闭包,并且函数在Go语言中属于“一等公民”. 函数定义 Go语言中定义 ...
- Huawei重新开启隐藏桌面功能
在HUAWEI的EMUI系统7.0的时候我们都能发现桌面上靠手指操作的隐藏桌面的功能,像这样: 但是在之后的EMUI8.0.9.0,之后就没有办法用了.后来问了官方,这个功能确实是被去掉了.个人也很不 ...
- Create your first Java application
参考链接 -[IntelliJ IDEA] https://www.jetbrains.com/help/idea/creating-and-running-your-first-java-appli ...
- PHP写入文件
file_put_contents('log.txt',PHP_EOL.'zhangsan'.$time.'查看了数据', FILE_APPEND);
- WPF 不要给 Window 类设置变换矩阵(分析篇):System.InvalidOperationException: 转换不可逆。
原文:WPF 不要给 Window 类设置变换矩阵(分析篇):System.InvalidOperationException: 转换不可逆. 最近总是收到一个异常 "System.Inva ...