最近要往arm开发板上移植android系统,大大小小的问题遇到了太多太多,都是泪啊。本人初接触嵌入式开发,对问题的根源不是太了解,不过好在每解决一个问题,便记录一下。话不多说,正式罗列问题:

 host Executable: a3dconvert (out/host/linux-x86/obj/EXECUTABLES/a3dconvert_intermediates/a3dconvert)
/usr/bin/ld: skipping incompatible /usr/lib/gcc/x86_64-linux-gnu/4.5./libstdc++.so when searching for -lstdc++
/usr/bin/ld: skipping incompatible /usr/lib/gcc/x86_64-linux-gnu/4.5./libstdc++.a when searching for -lstdc++
/usr/bin/ld: cannot find -lstdc++
/usr/bin/ld: skipping incompatible /usr/lib/gcc/x86_64-linux-gnu/4.5./libgcc_s.so when searching for -lgcc_s
/usr/bin/ld: cannot find -lgcc_s
/usr/bin/ld: skipping incompatible /usr/lib/gcc/x86_64-linux-gnu/4.5./libgcc.a when searching for -lgcc
/usr/bin/ld: cannot find -lgcc
collect2: ld returned exit status
make: *** [out/host/linux-x86/obj/EXECUTABLES/a3dconvert_intermediates/a3dconvert] Error
解决方法:
缺少g++-multilib库,安装即可: apt-get install g++-multilib
$ sudo apt-get install g++-multilib g++-4.5-multilib
 g++: 错误: –fpermissive:没有那个文件或目录
make: *** [out/host/linux-x86/obj/STATIC_LIBRARIES/libutils_intermediates/RefBase.o] 错误
解决方法:
sudo apt-get install g++-4.4-multilib
 rameworks/base/libs/utils/RefBase.cpp: 在成员函数‘void android::RefBase::weakref_type::trackMe(bool, bool)’中:
frameworks/base/libs/utils/RefBase.cpp::: 错误: 将‘const android::RefBase::weakref_impl’作为‘void android::RefBase::weakref_impl::trackMe(bool, bool)’的‘this’实参时丢弃了类型限定 [-fpermissive]
make: *** [out/host/linux-x86/obj/STATIC_LIBRARIES/libutils_intermediates/RefBase.o] 错误
原因:
Ubuntu 11.10的gcc 4.6版本太高了,android编译需要gcc 4.4
解决方法:
更换gcc、g++版本4.6为4.4
sudo apt-get install gcc-4.4
sudo apt-get install g++-4.4
sudo rm -rf /usr/bin/gcc /usr/bin/g++
sudo ln -s /usr/bin/gcc-4.4 /usr/bin/gcc
sudo ln -s /usr/bin/g++-4.4 /usr/bin/g++
 /usr/bin/ld: cannot find -lz
host Executable: aapt (out/host/linux-x86/obj/EXECUTABLES/aapt_intermediates/aapt)
/usr/bin/ld: cannot find -lz
collect2: ld returned exit status
make: *** [out/host/linux-x86/obj/EXECUTABLES/aapt_intermediates/aapt] Error
解决方法:
sudo apt-get install zlib1g-dev
sudo apt-get install lib64z1-dev
 /bin/bash: bison: command not found
Yacc: aidl <= frameworks/base/tools/aidl/aidl_language_y.y
bison -d -o out/host/linux-x86/obj/EXECUTABLES/aidl_intermediates/aidl_language_y.cpp frameworks/base/tools/aidl/aidl_language_y.y
/bin/bash: bison: command not found
make: *** [out/host/linux-x86/obj/EXECUTABLES/aidl_intermediates/aidl_language_y.cpp] Error
解决方法:
sudo apt-get install bison
 /bin/bash: flex: command not found
out/host/linux-x86/obj/EXECUTABLES/aidl_intermediates/aidl_language_y.cpp: In function ‘int yyparse()’:
out/host/linux-x86/obj/EXECUTABLES/aidl_intermediates/aidl_language_y.cpp:: warning: deprecated conversion from string constant to ‘char*’
out/host/linux-x86/obj/EXECUTABLES/aidl_intermediates/aidl_language_y.cpp:: warning: deprecated conversion from string constant to ‘char*’
Lex: aidl <= frameworks/base/tools/aidl/aidl_language_l.l
/bin/bash: flex: command not found
make: *** [out/host/linux-x86/obj/EXECUTABLES/aidl_intermediates/aidl_language_l.cpp] Error
解决方法: 
sudo apt-get install flex
 /usr/bin/ld: cannot find -lncurses
host Executable: adb (out/host/linux-x86/obj/EXECUTABLES/adb_intermediates/adb)
/usr/bin/ld: cannot find -lncurses
collect2: ld returned exit status
make: *** [out/host/linux-x86/obj/EXECUTABLES/adb_intermediates/adb] Error
解决方法:
sudo apt-get install libncurses5-dev
 fatal error: GL/glx.h: No such file or directory
development/tools/emulator/opengl/host/libs/Translator/GLcommon/GLDispatch.cpp:: fatal error: GL/glx.h: No such file or directory
compilation terminated.
make: *** [out/host/linux-x86/obj/STATIC_LIBRARIES/libGLcommon_intermediates/GLDispatch.o] Error
解决方法:
sudo apt-get install libgl1-mesa-dev
 sh: gperf: not found
target Generated: libwebcore <= external/webkit/Source/JavaScriptCore/create_regex_tables
Generating CSSPropertyNames.h <= CSSPropertyNames.in
sh: gperf: not found
calling gperf failed: at ./makeprop.pl line .
make: *** [out/target/product/generic/obj/STATIC_LIBRARIES/libwebcore_intermediates/Source/WebCore/css/CSSPropertyNames.h] Error
make: *** Deleting file `out/target/product/generic/obj/STATIC_LIBRARIES/libwebcore_intermediates/Source/WebCore/css/CSSPropertyNames.h'
解决方法:
sudo apt-get install gperf
 host C++: libutils <= frameworks/base/libs/utils/RefBase.cpp
frameworks/base/libs/utils/RefBase.cpp: In member function ‘void android::RefBase::weakref_type::trackMe(bool, bool)’:
frameworks/base/libs/utils/RefBase.cpp::: error: passing ‘const android::RefBase::weakref_impl’ as ‘this’ argument of ‘void android::RefBase::weakref_impl::trackMe(bool, bool)’ discards qualifiers [-fpermissive]
make: *** [out/host/linux-x86/obj/STATIC_LIBRARIES/libutils_intermediates/RefBase.o] 错误
解决方法:
gedit frameworks/base/libs/utils/Android.mk
将语句:
LOCAL_CFLAGS += -DLIBUTILS_NATIVE=1 $(TOOL_CFLAGS)
修改为:
LOCAL_CFLAGS += -DLIBUTILS_NATIVE=1 $(TOOL_CFLAGS) –fpermissive
 out/host/linux-x86/obj/STATIC_LIBRARIES/libcutils_intermediates/libcutils.a(threads.o): In function `thread_store_get':
/home/leno/works/android_dev/bin/system/core/libcutils/threads.c:: undefined reference to `pthread_getspecific'
out/host/linux-x86/obj/STATIC_LIBRARIES/libcutils_intermediates/libcutils.a(threads.o): In function `thread_store_set':
/home/leno/works/android_dev/bin/system/core/libcutils/threads.c:: undefined reference to `pthread_key_create'
/home/leno/works/android_dev/bin/system/core/libcutils/threads.c:: undefined reference to `pthread_setspecific'
collect2: ld returned exit status
make: *** [out/host/linux-x86/obj/EXECUTABLES/localize_intermediates/localize] 错误
解决方法:
修改./framework/base/tools/localize/Android.mk文件
ifeq ($(HOST_OS),linux)
#LOCAL_LDLIBS += -lrt       把这行注释掉,改为下面一行。
LOCAL_LDLIBS += -lrt -lpthread
endif

Android 源码编译及常见错误及解决方法的更多相关文章

  1. 源码编译apache报错的解决方法

    源码编译apache报错的解决方法   问题介绍 在源码编译安装httpd时,./configure执行无错误,到make时就报错,在网络上搜索了很多文章,很多方法如换apr-util的低版本并不能很 ...

  2. android 源码编译中的错误 解决

    1.编译种错误提示: arm-none-linux-gnueabi-gcc: directory: No such file or directory arm-none-linux-gnueabi-g ...

  3. 【转】Android 源码编译make的错误处理--不错

    原文网址:http://blog.csdn.net/ithomer/article/details/6977386 Android源码下载:官方下载 或参考android源码下载方式 Android编 ...

  4. Android源码编译make的错误处理

    android源码下载:官方下载 或参考android源码下载方式 Android编译版本: PLATFORM_VERSION=4.0.1(最新Android 4.0.1) OS 操作系统平台: Li ...

  5. Ubuntu编译Android源码过程中的空间不足解决方法

    Android源码一般几十G,就拿Android5.0来说,下载下来大概也有44G左右,和编译产生的文件以及Ubuntu系统占用的空间加起来,源码双倍的空间都不够有.编译源码前能分配足够的空间再好不过 ...

  6. jdk/java版本与Android源码编译中的错误

    错误一:javap未指向有效的java版本 Traceback (most recent call last): File "../../base/android/jni_generator ...

  7. Linux下编译PHP常见错误及解决方法

    1.configure: error: xml2-config not found. Please check your libxml2 installation.yum install libxml ...

  8. 有关android源码编译的几个问题

    项目用到编译环境,与源码有些差异不能照搬,关键是连源码都没编译过,下面基本上是行网上照的各种自学成才的分享,病急乱投医了,都记在下面作为参照吧. 1.验证是否编译正确,在终端执行 emulator & ...

  9. [Android Pro] Android源码编译之Nexus5真机编译

    reference to : http://blog.csdn.net/liu1075538266/article/details/51272398 1.   前言 在Android安全的研究工作中, ...

随机推荐

  1. Java和C#在面向对象上语法的区别

    做了几年了开发一直没有总结什么,回到了家乡的小城做了一名培训班的教员,教授软件开发的知识.细小的知识从头细细嚼来,别有一番滋味.或是以前遗漏的太多,或是确实没有系统的学习过,教学生的过程中自己也对教材 ...

  2. 使用CKEditor编辑器进行文本编辑

    首先下载CKEditor. 下载地址:点击打开链接 将下载完的CKEditor解压而且导入到项目中. 然后在页面引入CKEditor <script type="text/javasc ...

  3. SQL中declare申明变量

    在sql语句中加入�变量. declare @local_variable data_type 声明时须要指定变量的类型, 能够使用set和select对变量进行赋值, 在sql语句中就能够使用@lo ...

  4. ValueBar

    https://github.com/PhilJay/ValueBar

  5. Servlet---JavaWeb技术的核心基础,JavaWeb框架的基石(二)

    一.Servlet之Request         Web服务器会对收到的每一次客户端http请求分别创建一个用于代表请求的request对象和代表响应的response对象.要获取客户端提交的数据需 ...

  6. 通过GitHub和Hexo搭建个人博客

    LinEvan个人博客 最终有自己的个人博客,逼格一下子提高说不少. 网上一搜教程一大堆,非常多已经写得非常好了,我就不凑这个热闹了.推荐一篇博文:怎样搭建一个独立博客--简明Github Pages ...

  7. javascript操作

    1. >> 按位右移运算符 result = expression1 >> expression2 右移表达式的位,保持符号不变. >> 运算符将 expressi ...

  8. 【ZZ】超全面的设计模式总结

    http://www.cnblogs.com/chenssy/p/3357683.html#rd

  9. SparkSQLTest.scala

    /** * Created by root on 9/7/15. */ import org.apache.spark.SparkConf import org.apache.spark.SparkC ...

  10. day03 Java基础

    1.面试题 (1)short s=1;s=s+1; (2)short s=1;s+=1; 上面两行代码有没有问题,如果有,哪里有问题? 答:第一个有问题,s+1是int类型的值,赋值给short的s, ...