错误一:javap未指向有效的java版本

Traceback (most recent call last):
File "../../base/android/jni_generator/jni_generator.py", line 1065, in <module>
sys.exit(main(sys.argv))
File "../../base/android/jni_generator/jni_generator.py", line 1061, in main
options.optimize_generation)
File "../../base/android/jni_generator/jni_generator.py", line 996, in GenerateJNIHeader
jni_from_javap = JNIFromJavaP.CreateFromClass(input_file, namespace)
File "../../base/android/jni_generator/jni_generator.py", line 507, in CreateFromClass
stderr=subprocess.PIPE)
File "/usr/lib/python2.7/subprocess.py", line 709, in __init__
errread, errwrite)
File "/usr/lib/python2.7/subprocess.py", line 1326, in _execute_child
raise child_exception
OSError: [Errno 2] No such file or directory
make: *** [/home/odexcide/android-4./out/target/product/generic/obj/GYP/shared_intermediates/ui/gl/jni/Surface_jni.h] Error 1
make: *** Waiting for unfinished jobs..

原因 javap不存在于环境变量中

使用 sudo update-alternatives --config javap 查看指向,选择合适的版本,如果不存在,则添加javap

sudo update-alternatives --install /usr/bin/javap javap /usr/lib/jvm/jdk1.6.0_45/bin/javap 300

配置 sudo update-alternatives --config javap 注:如果只有一个可选的话,则不会列表,即无需处理

错误二 Chromium gyp HashSet_jni.h

out/target/product/mx3/obj/GYP/shared_intermediates/content/jni/HashSet_jni.h:10:26: error: extra tokens at end of #ifndef directive [-Werror]
out/target/product/mx3/obj/GYP/shared_intermediates/content/jni/HashSet_jni.h:11:26: error: missing whitespace after the macro name [-Werror]
target thumb C++: content_content_common_gyp <= external/chromium_org/content/common/android/surface_texture_peer.cc
In file included from external/chromium_org/content/common/android/hash_set.cc:5:0:
out/target/product/mx3/obj/GYP/shared_intermediates/content/jni/HashSet_jni.h:24:20: error: expected initializer before '<' token
out/target/product/mx3/obj/GYP/shared_intermediates/content/jni/HashSet_jni.h:26:17: error: expected initializer before '<' token
out/target/product/mx3/obj/GYP/shared_intermediates/content/jni/HashSet_jni.h:29:22: error: expected '{' before '<' token
out/target/product/mx3/obj/GYP/shared_intermediates/content/jni/HashSet_jni.h:29:22: error: expected unqualified-id before '<' token
external/chromium_org/content/common/android/hash_set.cc:30:1: error: expected '}' at end of input
cc1plus: all warnings being treated as errors
make: *** [out/target/product/mx3/obj/STATIC_LIBRARIES/content_content_common_gyp_intermediates/content/common/android/hash_set.o] 错误 1
make: *** 正在等待未完成的任务....

这可能是由于java版本不符,请安装相应版本的jdk。

此外, 如果尚未解决,可参考此帖进行修改源码,本人不建议

jdk/java版本与Android源码编译中的错误的更多相关文章

  1. android 源码编译中的错误 解决

    1.编译种错误提示: arm-none-linux-gnueabi-gcc: directory: No such file or directory arm-none-linux-gnueabi-g ...

  2. 【转】Android 源码编译make的错误处理--不错

    原文网址:http://blog.csdn.net/ithomer/article/details/6977386 Android源码下载:官方下载 或参考android源码下载方式 Android编 ...

  3. Android源码编译make的错误处理

    android源码下载:官方下载 或参考android源码下载方式 Android编译版本: PLATFORM_VERSION=4.0.1(最新Android 4.0.1) OS 操作系统平台: Li ...

  4. Android 源码编译及常见错误及解决方法

    最近要往arm开发板上移植android系统,大大小小的问题遇到了太多太多,都是泪啊.本人初接触嵌入式开发,对问题的根源不是太了解,不过好在每解决一个问题,便记录一下.话不多说,正式罗列问题: hos ...

  5. [Android Pro] Android源码编译之Nexus5真机编译

    reference to : http://blog.csdn.net/liu1075538266/article/details/51272398 1.   前言 在Android安全的研究工作中, ...

  6. android源码编译-Mac 10.11 xcode5.1.1

    第一步: 参考官网:创建一个dmg,大小80g,这个要尽量大一点,40g感觉不够用:http://source.android.com/source/initializing.html 第二步:下载a ...

  7. Android源码编译jar包BUILD_JAVA_LIBRARY 与BUILD_STATIC_JAVA_LIBRARY的区别(二)

    上文简单介绍了BUILD_JAVA_LIBRARY 与BUILD_STATIC_JAVA_LIBRARY编译出来jar包的区别, 那么你如果拿到了一个内容是dex格式的jar包,而你又偏偏需要这个ja ...

  8. 有关android源码编译的几个问题

    项目用到编译环境,与源码有些差异不能照搬,关键是连源码都没编译过,下面基本上是行网上照的各种自学成才的分享,病急乱投医了,都记在下面作为参照吧. 1.验证是否编译正确,在终端执行 emulator & ...

  9. 【Android开发】构建Android源码编译环境

    原文:http://android.eoe.cn/topic/android_sdk 构建Android源码编译环境 1 2 3 4 5 6 7 8 9 10 11 12 13 14 15 16 17 ...

随机推荐

  1. Installing Wine 1.5: configure: error: Cannot build a 32-bit program, you need to install 32-bit development libraries(转载)

    Installing Wine 1.5: configure: error: Cannot build a 32-bit program, you need to install 32-bit dev ...

  2. js函数形参和实参的区别

    在<Javascript权威指南>中这样定义: 参数有形参(parameter)和实参(argument)的区别,形参相当于函数中定义的变量,实参是在运行时的函数调用时传入的参数. 说明白 ...

  3. 行为型设计模式之状态模式(State)

    结构 意图 允许一个对象在其内部状态改变时改变它的行为.对象看起来似乎修改了它的类. 适用性 一个对象的行为取决于它的状态, 并且它必须在运行时刻根据状态改变它的行为. 一个操作中含有庞大的多分支的条 ...

  4. Mac下jdk多版本管理

    网上试了.bash_profile中增加路径设置别名的方法,但是始终无法切换,只能使用jenv了. 1. 下载 jenv(来自官网) git clone https://github.com/gcui ...

  5. flask的orm框架(SQLAlchemy)-操作数据

    # 原创,转载请留言联系 Flask-SQLAlchemy 实现增加数据 用 sqlalchemy 添加数据时,一定要注意,不仅仅要连接到数据表,并且你的创建表的类也必须写进来.而且字段和约束条件要吻 ...

  6. hdu 5087(次长上升子序列)

    Revenge of LIS II Time Limit: 2000/1000 MS (Java/Others)    Memory Limit: 32768/32768 K (Java/Others ...

  7. 阿里云服务器,tomcat启动,一直卡在At least one JAR was scanned for TLDs yet contained no TLDs就不动了

    项目在本地是可以成功运行的,网上看到一堆各式各样的解决办法感觉都不适合我,于是绝望的删webapps,重新上传,一直不行. 重复了第3次还是第4次,居然就好了,这是什么操作.

  8. APP专项测试 | 内存及cpu

    命令: adb shell dumpsys meminfo  packagename 关注点: 1.Native/Dalvik 的 Heap 信息 具体在上面的第一行和第二行,它分别给出的是JNI层和 ...

  9. Sunscreen

    题目描述 To avoid unsightly burns while tanning, each of the C (1 ≤ C ≤ 2500) cows must cover her hide w ...

  10. luogu P1347 排序

    题目描述 一个不同的值的升序排序数列指的是一个从左到右元素依次增大的序列,例如,一个有序的数列A,B,C,D 表示A<B,B<C,C<D.在这道题中,我们将给你一系列形如A<B ...