错误原因在于由于文件 node_modules 太大,在项目上传时有些人会删掉

导致我们下载的项目中缺少这个文件

在尝试把自己项目的 node_modules文件夹直接复制过去之后发现问题还没有得到解决

解决方法:在命令行中先进入文件所在路径

然后输入命令

npm i

然后发现项目中多出了 文件node_modules

然后输入

npm run dev
发现项目运行成功

npm ERR! code ELIFECYCLE npm ERR! errno 1 npm ERR! test_vue_0613@1.0.0 dev: 错误的解决方法的更多相关文章

  1. 在终端输入npm run serve时出现npm ERR! code ELIFECYCLE npm ERR! errno 1 npm ERR! test_vue_0613@1.0.0 dev: 错误的解决方法

    在vscode终端使用命令 npm run serve 的时候报错 错误原因在于由于文件 node_modules 太大,在项目上传时有些人会删掉 导致我们下载的项目中缺少这个文件 在尝试把自己项目的 ...

  2. 输入npm install 报错npm ERR! code ELIFECYCLE npm ERR! errno 1 npm ERR! node-sass@4.13.1 postinstall: `node scripts/build.js`

    输入npm install 报以下错误 npm ERR! code ELIFECYCLE npm ERR! errno 1 npm ERR! node-sass@4.13.1 postinstall: ...

  3. npm ERR! code ELIFECYCLE webpack-dev-server --inline --progress --config build/webpack.dev.conf.js`

    “E:\Program Files\JetBrains\WebStorm 2018.1.4\bin\runnerw.exe” G:\node\nodejs\node.exe G:\node\nodej ...

  4. npm install 超时 国内 切换源; npm ERR! code ELIFECYCLE;

    install 超时 查看npm源地址 npm config get registry #http://registry.npmjs.org 为国外镜像地址 设置阿里云镜像 npm config se ...

  5. window10 安装出现the error code is 2503错误的解决方法

    window10 安装出现the error code is 2503错误的解决方法:  设置 C:\WINDOWS\TEMP的权限

  6. Code First研究学习2_基本的错误及解决方法

    使用Code First时总有很多的问题出现,以下列举了一些基本的错误及解决方法! 1.当用Enable-Migrations启动数据库迁移后,如果再继续输入Enable-Migrations命令,则 ...

  7. appium-chromedriver@3.0.1 npm ERR! code ELIFECYCLE npm ERR! errno 1

    解决方法: npm install appium-chromedriver@3.0.1 --ignore-scripts 或者(安装方法): npm install appium-chromedriv ...

  8. 虚拟机服务启动失败报错npm ERR! code ELIFECYCLE

    可能是由于node_modules模块中缺失或者某些东西冲突引起的,我们可以使用如下的方法解决这个: rm -rf node_modules 删除,不询问 rm package-lock.json 删 ...

  9. SyntaxError: Non-UTF-8 code starting with '\xba' in file 错误的解决方法!!

    第一次在Eclipse建立python工程,添加了自己新建的文件,写了一点代码,随后执行时候出现了错误,和昨天我在Visual Studio 2015里面一样,错误: SyntaxError: Non ...

随机推荐

  1. git删除远程仓库中的文件夹

    具体操作如下: git rm -r --cached .history    #删除目录 git commit -m”删除.history文件夹” git push -r表示递归所有子目录,如果你要删 ...

  2. 软件WEB自动化测试工具之智能元素定位

    江湖一直有着这么一句名言“天下武功,唯快不破".那么在软件测试领域,自然而然我们会想到软件自动化测试.软件自动化测试的实现自然离不开软件自动化测试工具.软件自动化测试工具是软件自动化的载体, ...

  3. gcc错误[Error] ld returned 1 exit status

    出现这个错误的原因是:(目前遇见两种情况了) 你的编译器正在执行刚刚的程序还没关:小黑框还在. 解决措施:关闭就好. 定义的函数和调用的函数名字不一样,也会造成产生这种错误!!!代码如下: bool ...

  4. Web Scraper 高级用法——利用正则表达式筛选文本信息 | 简易数据分析 17

    这是简易数据分析系列的第 17 篇文章. 学习了这么多课,我想大家已经发现了,web scraper 主要是用来爬取文本信息的. 在爬取的过程中,我们经常会遇到一个问题:网页上的数据比较脏,我们只需要 ...

  5. Day1T3小w的魔术扑克——图论

    为什么不搞\(T2\)??? 因为我太菜了,那题我是真的搞不出来 题目描述 链接:https://ac.nowcoder.com/acm/contest/1100/C 来源:牛客网 小\(w\)喜欢打 ...

  6. C++ 【静态成员】static修饰的成员

    首先,我们先通过字面意思来理解... 成员:成员变量.成员函数. static  修饰成员变量,还有修饰成员函数. static  声明为静态的,称为静态成员.不管这个类创建了多少个对象,静态成员只有 ...

  7. Nginx配置Web项目(多页面应用,单页面应用)

    目前前端项目 可分两种: 多页面应用,单页面应用. 单页面应用 入口是一个html文件,页面路由由js控制,动态往html页面插入DOM. 多页面应用 是由多个html文件组成,浏览器访问的是对应服务 ...

  8. Salesforce LWC学习(十三) 简单知识总结篇一

    本篇参考:https://developer.mozilla.org/zh-CN/docs/Web/JavaScript 随着项目的学习以及trailhead的学习,会遇见自己曾经模糊的定义或者比较浪 ...

  9. python函数版ATM

    最近系统的学习python函数知识点,感觉在面向对象之前,函数的功能确实强大. 最近使用函数写了ATM项目,虽然需求简单但也有很多知识点需要注意,这个项目把python基础的很多知识点都用上了. 前前 ...

  10. Uncovering thousands of new peptides with sequence-mask-search hybrid de novo peptide sequencing framework (使用序列掩码搜索结合肽段从头测序框架发现了数千个新肽段)-解读人:刘佳维

    期刊名:Molecular & Cellular Proteomics 发表时间:(2019年12月) IF:4.828 单位: 朱拉隆功大学 费城威斯塔研究所 物种:人 技术:de novo ...