maven install 报错 No compiler is provided in this environment. Perhaps you are running on a JRE rather than a JDK?
1、控制台打印信息
[INFO] Scanning for projects...
[INFO]
[INFO] ---------------------< org.cqupt.mauger:Resource >----------------------
[INFO] Building Resource Maven Webapp 0.0.1-SNAPSHOT
[INFO] --------------------------------[ war ]---------------------------------
[INFO]
[INFO] --- maven-resources-plugin:3.0.2:resources (default-resources) @ Resource ---
[INFO] Using 'UTF-8' encoding to copy filtered resources.
[INFO] Copying 2 resources
[INFO]
[INFO] --- maven-compiler-plugin:3.7.0:compile (default-compile) @ Resource ---
[INFO] Changes detected - recompiling the module!
[INFO] Compiling 3 source files to D:\demo\target\classes
[INFO] -------------------------------------------------------------
[ERROR] COMPILATION ERROR :
[INFO] -------------------------------------------------------------
[ERROR] No compiler is provided in this environment. Perhaps you are running on a JRE rather than a JDK?
[INFO] 1 error
[INFO] -------------------------------------------------------------
[INFO] ------------------------------------------------------------------------
[INFO] BUILD FAILURE
[INFO] ------------------------------------------------------------------------
[INFO] Total time: 1.656 s
[INFO] Finished at: 2018-11-06T02:59:02+08:00
[INFO] ------------------------------------------------------------------------
[ERROR] Failed to execute goal org.apache.maven.plugins:maven-compiler-plugin:3.7.0:compile (default-compile) on project Resource: Compilation failure
[ERROR] No compiler is provided in this environment. Perhaps you are running on a JRE rather than a JDK?
[ERROR] -> [Help 1]
[ERROR]
[ERROR] To see the full stack trace of the errors, re-run Maven with the -e switch.
[ERROR] Re-run Maven using the -X switch to enable full debug logging.
[ERROR]
[ERROR] For more information about the errors and possible solutions, please read the following articles:
[ERROR] [Help 1] http://cwiki.apache.org/confluence/display/MAVEN/MojoFailureException
2、修改 Install JREs,选用 jdk,移除 jre
参考:https://blog.csdn.net/lslk9898/article/details/73836745
maven install 报错 No compiler is provided in this environment. Perhaps you are running on a JRE rather than a JDK?的更多相关文章
- maven启动报错No compiler is provided in this environment. Perhaps you are running on a JRE rather than a JDK?
[INFO] Scanning for projects... [WARNING] [WARNING] Some problems were encountered while building th ...
- Maven构建项目出现No compiler is provided in this environment. Perhaps you are running on a JRE rather than a JDK?
No compiler is provided in this environment. Perhaps you are running on a JRE rather than a JDK? 你应该 ...
- maven打包错误:No compiler is provided in this environment. Perhaps you are running on a JRE rather than a JDK?
[INFO] Scanning for projects...[INFO] ...
- Maven错误:[ERROR] No compiler is provided in this environment. Perhaps you are running on a JRE rather than a JDK?的解决方法
错误: [ERROR] No compiler is provided in this environment. Perhaps you are running on a JRE rather tha ...
- No compiler is provided in this environment. Perhaps you are running on a JRE rather than a JDK? idea maven 打包报错问题解决
mvn clean install -X -Dmaven.test.skip=true -P dev 打包报错:No compiler is provided in this environment. ...
- 【maven】maven的web项目打包报错:No compiler is provided in this environment. Perhaps you are running on a JRE rather than a JDK
打包过程中报错如下: No compiler is provided in this environment. Perhaps you are running on a JRE rather than ...
- maven No compiler is provided in this environment. Perhaps you are running on a JRE rather than a JDK?
maven install项目时出错,提示信息如下: [ERROR] Failed to execute goal org.apache.maven.plugins:maven-compiler-pl ...
- Maven No compiler is provided in this environment. Perhaps you are running on a JRE rather than a JDK? 问题
maven编译项目时出错,提示信息如下: [ERROR] Failed to execute goal org.apache.maven.plugins:maven-compiler-plugin:3 ...
- Maven异常: No compiler is provided in this environment. Perhaps you are running on a JRE rather than a JDK解决(能力工场小马哥)
问题描述: No compiler is provided in this environment. Perhaps you are running on a JRE rather than a JD ...
随机推荐
- “无法找到XXX.exe的调试信息,或调试信息不匹配”解决方案
错误信息如下: 解决方法: 选择项目属性,依次序进行如下操作. 1.选择 配置属性->链接器->调试->生成调试信息 改为 是 一般问题都是出现在这个地方,修改完了可以尝试运行,若还 ...
- WIN10配置MongoDB
WIN10配置MongoDB 1. 下载 [MongoDB 官网下载链接](https://www.mongodb.com/download-center?jmp=nav#community) 2. ...
- python 的基础 学习 12天,函数
1, *args 动态 参数,万能参数 *args就是接受实参对应的剩余的位置参数,并将其放在元组中.在定义函数时,*args代表的是聚合. def func(*args): print(ar ...
- 【深入分析Java Web技术内幕】2、深入分析Java I/O的工作机制
Java的I/O类库的基本架构 基于字节操作的IO接口:InputStream.OutputStream 基于字符操作的IO接口:Writer.Reader 基于磁盘操作的IO接口:File 基于网络 ...
- 【提示框】【计时事件】【cookie】
1.提示框 1)警告框 <script>function disp_alert(){alert("我是警告框!!")}</script> 2)确认框 fun ...
- mysql 8.0 ~ 存储和账户
一 简介:关于存储数据文件的改进二 数据文件: 1合并了存储数据库对象信息的事务性数据字典 1 相关文件等存储引擎层存储元数据文件已消失,只有ibd文件,元数据存储在数据字典表 ...
- 20165234 《Java程序设计》第八周学习总结
第八周学习总结 教材内容学习 第十二章 Java 多线程机制 进程与线程 进程是程序的一次动态执行过程,对应了从代码加载.执行至执行完毕的一个完整过程. 线程不是进程,是比进程更小的执行单位. 一个进 ...
- flask基本介绍及虚拟环境
Flask Flask诞生于2010年,是Armin ronacher(人名)用 Python 语言基于 Werkzeug 工具箱编写的轻量级Web开发框架. Flask 本身相当于一个内核,其他几乎 ...
- centos U盘挂载问题
查看u盘路径 fdisk -l Disk /dev/sda: 16.2 GB, 16236150784 bytes, 31711232 sectors Units = sectors of 1 * 5 ...
- P4070 [SDOI2016]生成魔咒
题目地址:P4070 [SDOI2016]生成魔咒 相信看到题目之后很多人跟我的思路是一样的-- 肯定要用 SA(P3809 [模板]后缀排序) 肯定要会求本质不同的子串个数(P2408 不同子串个数 ...