Problem Description:

java.sql.SQLException: EXECUTION FAILED: Task MAPRED-SPARK error
SparkException: [Error 1] Topo check failed. Mapred tasks exceed
1000000000

Root Cause:

数据量太大导致,需要设小reduce个数

Solution:

通过设置参数set mapred.reduce.tasks=xx;

Topo check failed. Mapred tasks exceed 1000000000的更多相关文章

  1. caffe 训练时,出现错误:Check failed: error == cudaSuccess (4 vs. 0) unspecified launch failure

    I0415 15:03:37.603461 27311 solver.cpp:42] Solver scaffolding done.I0415 15:03:37.603549 27311 solve ...

  2. caffe: test code Check failed: K_ == new_K (768 vs. 1024) Input size incompatible with inner product parameters.

    I0327 20:24:22.966171 20521 net.cpp:849] Copying source layer drop7I0327 20:24:22.966179 20521 net.c ...

  3. caffe: test code 执行出问题: Check failed: FLAGS_weights.size() > 0 (0 vs. 0) Need model weights to score.

    Check failed: FLAGS_weights.size() > 0 (0 vs. 0) Need model weights to score. 出现这个错误,但是我记得昨天还好好的, ...

  4. npm check failed 解决办法

    npm ERR! shasum check failed for C:\Users\MM\AppData\Local\Temp\npm-10900-415697c8\registry.npmjs.or ...

  5. JAVA使用HttpClient时报错:Algorithm constraints check failed on signature algorithm: MD5withRSA

    今天使用httpClient.executeMethod时抛出异常:java.security.cert.CertPathValidatorException: Algorithm constrain ...

  6. check failed status == cudnn_status_success (4 vs. 0) cudnn_status_internal_error

    Check failed: error == cudaSuccess (30 vs. 0) unknown error  这个有可能是显存不足造成的,或者网络参数不对造成的 check failed ...

  7. vue.runtime.esm.js:593 [Vue warn]: Invalid prop: custom validator check failed for prop "value".报错解决

    在uni中使用 picker组件,一直报错 vue.runtime.esm.js:593 [Vue warn]: Invalid prop: custom validator check failed ...

  8. npm 走 privoxy 代理经常出现 shasum check failed 的解决办法

    今天在下载一个比较大的项目,经常 shasum check failed ,太烦了,于是想切淘宝源,分别尝试 nrm 切换和传递 --registry ,结果都出现 Unexpected end of ...

  9. Check failed: status == CUBLAS_STATUS_SUCCESS (11 vs. 0) CUBLAS_STATUS_MAPPING_ERROR

    I0930 21:23:15.115576 30918 solver.cpp:281] Learning Rate Policy: multistepF0930 21:23:17.263314 310 ...

随机推荐

  1. WPF 调试时拖拽不生效

    WPF窗体代码 <Window x:Class="SerialLabelDemo.Test.Window10" xmlns="http://schemas.micr ...

  2. 【Redis3.0.x】配置文件

    Redis3.0.x 配置文件 概述 Redis 的配置文件位于Redis安装目录下,文件名为 redis.conf. 可以通过 CONFIG 命令查看或设置配置项. Redis 命令不区分大小写. ...

  3. 【Nginx】配置nginx图片服务器

    想通过nginx来访问服务器上的图片 可以搭建一个nginx图片服务器. 做法如下: 先安装nginx,这里直接用yum来进行安装的 安装方法如下: https://blog.csdn.net/iml ...

  4. Java反射全解析(使用、原理、问题、在Android中的应用)

    前言 今天说Java模块内容:反射. 反射介绍 正常情况下,我们知晓我们要操作的类和对象是什么,可以直接操作这些对象中的变量和方法,比如一个User类: User user=new User(); u ...

  5. CTFHub - Misc(流量分析)

    数据库类流量: MySQL流量: 1.下载附件,是一个.pcap文件,用wireshark分析, 2.搜索ctfhub字段,即可得到flag, flag: ctfhub{mysql_is_S0_E4s ...

  6. 这难道不是.NET5 的bug? 在线求锤?

    hello,最近在对一个使用.NET5项目的认证授权系统进行重构,对.NET 5的授权中间件的源码有些看法. 也希望同学们能帮我理解. 一个朴素的需求 这是一个api项目,默认所有的api都需要授权, ...

  7. 【译】Async/Await(三)——Aysnc/Await模式

    原文标题:Async/Await 原文链接:https://os.phil-opp.com/async-await/#multitasking 公众号: Rust 碎碎念 翻译 by: Praying ...

  8. 欢迎来到 ZooKeeper 动物世界

    本文作者:HelloGitHub-老荀 Hi,这里是 HelloGitHub 推出的 HelloZooKeeper 系列,免费有趣.入门级的 ZooKeeper 开源教程,面向有编程基础的新手. Zo ...

  9. Django-初阶实例

    调用本地css文件的方法 setting.py里面的内容 import os # Build paths inside the project like this: os.path.join(BASE ...

  10. Py-re正则模块,log模块,config模块,哈希加密

    9.re正则表达式模块,用于字符串的模糊匹配 元字符: 第一:点为通配符 用.表示匹配除了换行符以外的所有字符 import re res=re.findall('a..x','adsxwassxdd ...