STM32初学Keil4编译时出现 Error:Failed to execute 'BIN40/Armcc'
一种是在系统开始——运行里输入cmd,查看armcc状态。详情见推文:
http://blog.csdn.net/hicui/article/details/7350805(笔记记录,请勿见怪)
都没有问题的话,那么可以尝试:
在keil里的菜单栏依次选择Project->Manage->Components,Environment andBooks(CEB)(或者直接点击工具栏的图标),
然后在CEB里选择Folders/Extensions标签页,在RealView Folder里选择keil安装目录下的/ARM/BIN40,点OK后就可以正常使用了。

STM32初学Keil4编译时出现 Error:Failed to execute 'BIN40/Armcc'的更多相关文章
- android stdio 编译项目报Error:Failed to find target with hash string 'android-24
android stdio 编译项目报Error:Failed to find target with hash string 'android-24 查看已有的SDK 设置项目的sdk为 25 an ...
- [ERROR] Failed to execute goal org.codehaus.mojo:gwt-maven-plugin:2.5.0-rc1:compile (default) on project zeus-web: Command 解决
在编译maven项目,打包maven packeage -Dmaven.test.skip=TRUE时,报错“[ERROR] Failed to execute goal org.codehaus.m ...
- --- Error: failed to execute '.\ARMCC\bin\ArmAsm'
1.KEIL4在开发STM32程序时报: Error: failed to execute '.\ARMCC\bin\ArmAsm' 或是Error: failed to execute '.\ARM ...
- [ERROR] Failed to execute goal org.apache.maven.plugins:maven-war-plugin:2.2:war (default-war) on project child02
maven打包成war时,报错: [ERROR] Failed to execute goal org.apache.maven.plugins:maven-war-plugin:2.2:war (d ...
- Maven进行install的时候报错,COMPILATION ERROR : Failed to execute goal org.apache.maven.plugins:maven-surefire-plugin:2.13:test (default-test) on project cmu: There are test failures.
maven进行install的时候,test类里面报错: COMPILATION ERROR : [INFO] -------------------------------------------- ...
- [ERROR] Failed to execute goal org.apache.maven.plugins:maven-install-plugin:2.4: install (default-install) on project authorizationManagement-service: Failed to install metadata com.dmsdbj.itoo:autho
今天在打包时遇到这个问题: [ERROR] Failed to execute goal org.apache.maven.plugins:maven-install-plugin:2.4: inst ...
- [ERROR] Failed to execute goal org.apache.maven.plugins:maven-war-plugin:2.1.1:war
创建springboot项目,且不采用<parent>引入springboot时,pom.xml如下: <?xml version="1.0" encoding= ...
- [ERROR] Failed to execute goal org.apache.maven.plugins:maven-install-plugin:2.3.1:
security-sdk-1.0.jar已经存在于D:/secServerSDK-test/src/main/resources/lib下 报错如下: xxxxxx@xxxxxxxx /d/secSe ...
- [ERROR] Failed to execute goal org.apache.maven.plugins:maven-archetype-plugin:2.4:create (default-cli) on project standalone-pom: Unable to parse configuration of 3: mojo org.apache.maven.plugins:
问题: [ERROR] Failed to execute goal org.apache.maven.plugins:maven-archetype-plugin:2.4:create (defau ...
随机推荐
- JS常用数据校验集合(adding)
常用数据校验集合 var _validator = { MAIL_REGEX: /^(([^<>()[\]\\.,;:\s@\"]+(\.[^<>()[\]\\.,; ...
- Apple官方文档译文GitHub框架源码注解
引导
- 大数据 Hadoop,Spark和Storm
大数据(Big Data) 大数据,官方定义是指那些数据量特别大.数据类别特别复杂的数据集,这种数据集无法用传统的数据库进行存储,管理和处理.大数据的主要特点为数据量大(Volume),数据类别复 ...
- 【Android Developers Training】 54. 打印自定义文档
注:本文翻译自Google官方的Android Developers Training文档,译者技术一般,由于喜爱安卓而产生了翻译的念头,纯属个人兴趣爱好. 原文链接:http://developer ...
- 8.Smarty的条件判断语句的写法
{if $newObj eq 'a'} welcome a {elseif $a eq 'b'} welcome b {else} welcome others {/if}
- openssl req(生成证书请求和自建CA)
伪命令req大致有3个功能:生成证书请求文件.验证证书请求文件和创建根CA.由于openssl req命令选项较多,所以先各举几个例子,再集中给出openssl req的选项说明.若已熟悉openss ...
- VS2015 +Qt5 串口工具
简单的小工具是VS2015 + Qt5.6.1实现的,界面部分是Qt实现,串口是封装的WinAPI,把串口收发模块封装成了个Serialport.dll 供Qt界面调用. 由于VS2015需要CRT运 ...
- jsPlumb之流程图项目总结及实例
在使用jsPlumb过程中,所遇到的问题,以及解决方案,文中引用了<数据结构与算法JavaScript描述>的相关图片和一部分代码.截图是有点多,有时比较懒,没有太多的时间去详细的编辑. ...
- JProfiler - Java的性能监控工具
简介 JProfiler是一款Java的性能监控工具.可以查看当前应用的对象.对象引用.内存.CPU使用情况.线程.线程运行情况(阻塞.等待等),同时可以查找应用内存使用得热点,即:哪个对象占用的内存 ...
- voa 2015 / 4 / 14
Even with falling oil prices and strong U.S. growth, the head of the International Monetary Fund sai ...