vue.js环境配置步骤及npm run dev报错解决方案
安装完成后,使用npm run dev 运行,成功后,就可以在浏览器中看到vue的欢迎画面了
最后一步可能报错,我就遇到这样的问题了,

个人问题仅供参考:
ERROR Failed to compile with 2 errors
error in ./src/components/Hello.vue
Module build failed: Error: Missing binding /Users/fungleo/Sites/MyWork/vuedemo2/node_modules/node-sass/vendor/darwin-x64-57/binding.node Node Sass could not find a binding for your current environment: OS X 64-bit with Node.js 8.x
Found bindings for the following environments: - OS X 64-bit with Node.js 6.x
首先在项目目录下依次安装以下文件:
npm install node-sass
npm i node-sass -D
如果继续报错,会提醒安装element-ui就可以运行项目了,我们继续在项目目录下安装它就好了:
npm install --save element-ui
然后运行项目就OK啦,终于不报错啦!
vue.js环境配置步骤及npm run dev报错解决方案的更多相关文章
- 解决vue项目运行过程中,npm run dev 报错问题
[方案1] 错误如下: npm ERR! code ELIFECYCLE npm ERR! errno 1 npm ERR! travel@1.0.0 dev: `webpack-dev-server ...
- vue项目初始化时npm run dev报错webpack-dev-server解决方法
vue项目初始化时npm run dev报错webpack-dev-server解决方法 原因:这是新版webpack存在的BUG,卸载现有的新版本webpack,装老版本就好webpack-dev- ...
- nuxt.js 初始化 npm run dev 报错
在初始化 npm install 了基本依赖后: npm run dev 报错: error in ./server/index.js Module build failed: Error: Plug ...
- 巨坑npm run dev 报错 终于找到正确答案 Error: EPERM: operation not permitted, open '/data/public/build/css/add.p
Windows10环境 npm run dev 报错 终于找到正确答案 Error: EPERM: operation not permitted, open '/data/public/build ...
- Vue 项目: npm run dev 报错 webpack-dev-server
从码云上下载vue项目,运行npm run dev 时报错: > webpack-dev-server --inline --progress --config build/webpack.de ...
- npm run dev 报错 iview TypeError [ERR_INVALID_CALLBACK]: Callback must be a function
运行npm run dev报这个错 然后找到 D:\text\vue\iview-admin\build\webpack.dev.config.js打开 将这一行代码: fs.write(fd, bu ...
- npm run dev 报错:Error: Cannot find module 'webpack-cli/bin/config-yargs'
使用 npm run dev 时报错: Error: Cannot find module 'webpack-cli/bin/config-yargs' 原因是找不到webpack-cli这个包,使用 ...
- vue npm run dev 报错 semver\semver.js:312 throw new TypeError('Invalid Version: ' + version)
npm run dev运行报错信息如下图: 原因分析: 版本问题 解决办法: 在semver.js(node_modules/semver/semver.js)里做了一些改动,代码如下: // if ...
- vue项目npm run dev 报错error in ./src/main.js Module build failed: Error: Cannot find module 'babel-plugin-syntax-jsx'
问题: vue 项目npm run dev运行时报错,如下图: 原因: 缺少相应的组件 解决办法: 安装相应组件: npm install babel-plugin-syntax-jsx --sav ...
随机推荐
- centos6二进制安装mysql5.5
centos 6.5,安装mysql 5.5.60 所需安装包mysql-5.5.60-linux-glibc2.12-x86_64.tar.gz.ncurses-devel-5.7-4.200902 ...
- Spring Boot 2 (二):Spring Boot 2 动态 Banner
Spring Boot 2 (二):Spring Boot 2 动态 Banner Spring Boot 2.0 提供了很多新特性,其中就有一个小彩蛋:动态 Banner. 一.配置依赖 使用 Sp ...
- 标准库 string
1.func Fields(s string) []string,这个函数的作用是按照1:n个空格来分割字符串最后返回的是[]string的切片 package main import ( " ...
- 跟阿铭学Linux习题答案
第一章:走进Linux 1.简述它的发展历史,列举几种代表性的发行版 Linux之前是Unix,由于Unix收费昂贵,so,Richard Stallman 发起了开发自由软件的运动,并成立了自由软件 ...
- 汉诺塔问题(Hanoi Tower)递归算法解析(Python实现)
汉诺塔问题 1.问题来源:汉诺塔来源于印度传说的一个故事,上帝创造世界时作了三根金刚石柱子,在一根柱子上从上往下从小到大顺序摞着64片黄金圆盘.上帝命令婆罗门把圆盘从下面开始按大小顺序重新摆放在另一根 ...
- ubuntu 容器安装ping ifconfig ip命令
进入容器测试ifconfig ping 没有-------->>很尴尬 apt-get install net-tools ### ifconfig apt-get install ...
- 一、虚拟环境.二、路由配置主页与404.三、2.x路由分发.四、伪静态.五、request对象.六、FBV与CBV.七、文件上传.
一.虚拟环境 ''' 解决版本共存 1. 用pycharm选择File点击NewProject然后选择virtualenv创建一个纯净环境 2. 打开下载的目录将venv文件夹下的所有文件(纯净的环境 ...
- Python3基础 response.read 输出网页的源代码
Python : 3.7.0 OS : Ubuntu 18.04.1 LTS IDE : PyCharm 2018.2.4 Conda ...
- 4. 多重背包问题 I
多重背包问题 I 描述 有 NN 种物品和一个容量是 VV 的背包. 第 ii 种物品最多有 sisi 件,每件体积是 vivi,价值是 wiwi. 求解将哪些物品装入背包,可使物品体积总和不超过背包 ...
- bzoj1458: 士兵占领 网络流
链接 https://www.lydsy.com/JudgeOnline/problem.php?id=1458 也可以去luogu 思路 想成倒着删去点,使得依旧满足覆盖!! 左边横,右边列,之间用 ...