我的Android进阶之旅------>解决如下错误failed to copy 'Settings2.apk' to '/system/app//Settings2.apk': Read-only
push apk的时候报错
ouyangpeng@oyp-ubuntu:~/apk升级$ adb push Settings2.apk /system/app/
failed to copy 'Settings2.apk' to '/system/app//Settings2.apk': Read-only file system
解决方法:adb remount 一下
ouyangpeng@oyp-ubuntu:~/apk升级$ adb root
restarting adbd as root
ouyangpeng@oyp-ubuntu:~/apk升级$ adb remount
remount succeeded
再重新push进去
ouyangpeng@oyp-ubuntu:~/apk升级$ adb push Settings2.apk /system/app/
3654 KB/s (6481952 bytes in 1.732s)
成功
====================================================================================
作者:欧阳鹏 欢迎转载,与人分享是进步的源泉!
转载请保留原文地址:http://blog.csdn.net/ouyang_peng
===================================================================================
我的Android进阶之旅------>解决如下错误failed to copy 'Settings2.apk' to '/system/app//Settings2.apk': Read-only的更多相关文章
- 我的Android进阶之旅------>解决:Execution failed for task ':app:transformResourcesWithMergeJavaResForDebug'.
错误描述 今天在Android Studio项目中加入了jackson的开发包,编译运行时候,引发了如下的错误: Error:Execution failed for task ':app:trans ...
- 我的Android进阶之旅------>解决Jackson等第三方转换Json的开发包在开启混淆后转换的实体类数据都是null的bug
1.错误描述 今天测试人员提了一个bug,说使用我们的app出现了闪退的bug,后来通过debug断点调试,发现我们的app转换服务器发送过来的json数据后,都是为null.而之前已经提测快一个月的 ...
- 我的Android进阶之旅------>解决Android Studio编译后安装apk报错:The APK file does not exist on disk
1.错误描述 今天用Android Studio编译应用后安装APK的时候,报错了,错误如下所示: The APK file build\outputs\apk\OYP_2.3.4_I2Base_64 ...
- 我的Android进阶之旅------>解决:Failed to create 'build\outputs\apk\watch-debug-unaligned.apks': 拒绝访问。
1. 错误描述 今天用Android Studio进行项目编译的时候,报错如下所示: FAILURE: Build failed with an exception. * What went wron ...
- 我的Android进阶之旅------>解决DownloadManager报错java.lang.SecurityException: Invalid value for visibility: 2
1.问题描述 今天使用Android系统的DownloadManager进行下载操作时,爆了如下所示的错误: java.lang.RuntimeException: Unable to start s ...
- 我的Android进阶之旅------>解决Error: specified for property 'mergedManifest' does not exist.
错误描述 刚运行从Github上面下载而来的代码时,爆了如下所示的bug,错误描述如下所示: Error:A problem was found with the configuration of t ...
- 我的Android进阶之旅------>解决Error:Unable to find method 'org.gradle.api.internal.project.ProjectInternal.g
错误描述 今天在Github上面下载了一份代码,然后导入到Android Studio中直接报了如下图所示的错误: 错误描述如下: Error: Unable to find method 'org. ...
- 我的Android进阶之旅------>解决Error:Could not find property 'compile' on org.gradle.api.internal.artifacts.
1错误描述 解决方法 1错误原因 2解决方法 1.错误描述 刚刚,Android Studio突然编译不了了,报了如下错误: Error:Could not find property 'compil ...
- 我的Android进阶之旅------>解决Android Studio报错:DefaultAndroidProject : Unsupported major.minor version 52.0
问题描述 今天使用Android Studio 2.0打开我之前的项目时,编译报了如下错误: Error:Cause: com/android/build/gradle/internal/model/ ...
随机推荐
- 剖析ifstream打开含中文路径名文件失败的原因
http://blog.csdn.net/yukin_xue/article/details/7543423 最近写程序的时候遇到了使用ifstream打开含中文路径文件时失败的问题,在网上翻了一下, ...
- Linux基础学习5
程序管理与SELinux初探 process&program 程序 (program):通常为 binary program ,放置在储存媒体中 (如硬盘.光盘.软盘.磁带等), 为实体档案 ...
- 在Android上编译OSG[3.0.2 ] (转)
在Android上编译OSG[3.0.2 ] 分类:Android This file contents can be applied for version OpenSceneGraph(OSG ...
- 黑苹果+win10双系统折腾笔记
寒假趁机在家折腾一下黑苹果 笔记本配置:神船K610D I7 4600 ,其他配置思路一样,驱动要自己找 镜像和工具:OS X Yosemite 10.10.3 镜像 WIN10 TLSB 2016 ...
- 【音乐App】—— Vue-music 项目学习笔记:歌单及排行榜开发
前言:以下内容均为学习慕课网高级实战课程的实践爬坑笔记. 项目github地址:https://github.com/66Web/ljq_vue_music,欢迎Star. 歌单及详情页 排行榜及详情 ...
- Zabbix的前台SQL注射漏洞利用
今年8月份Map在wooyun上发了个Zabbix某前台SQL注射漏洞 ,11月份才公开. 漏洞详情大约是这样的: 在zabbix前端存在一个SQL注射漏洞,由于zabbix前台可以在zabbix的s ...
- Sereja and Array-数组操作或者线段树或树状数组
CodeForces - 315B Sereja and Array Time Limit: 1000MS Memory Limit: 262144KB 64bit IO Format: %I ...
- java:注解(一)
什么是注解 注解(Annotation),也叫(metadata)元数据.一种代码级别的说明.它是JDK1.5及以后版本引入的一个特性,与类.接口.枚举是在同一个层次.它可以声明在包.类.字段.方法. ...
- C#.Net调试时调无法“编辑并继续”
‘启用编辑并继续’的作用是允许用户在调试的过程中修改源代码,并且修改的代码会编译到调试进程中立刻生效. 在调试时,无法查到变量的值,也无法编辑,若编辑会跳出如下弹框: 解决方法: 1:如下图,选择De ...
- Cocos2d-x粒子系统
CCparticleSystem类封装实现对粒子的控制与调度,当中操作包含有: 1.产生粒子 2.更新粒子状态 3.回收无效的粒子 CCparticleSystem派生出CCParticleSyste ...