vue项目报错,解决Module build failed: Error: Cannot find module 'node-sass' 问题
1、报错问题
1 E:\WebStormFile\treehole-manage>npm run dev
> xc-ui-pc-sysmanage@1.0.0 dev E:\WebStormFile\treehole-manage
> webpack-dev-server --inline --progress --config build/webpack.dev.conf.js
94% asset optimization
ERROR Failed to compile with 2 errors 09:51:14 error in ./src/base/components/head.vue Module build failed: Error: Cannot find module 'node-sass'
at Function.Module._resolveFilename (module.js:547:15)
at Function.Module._load (module.js:474:25)
at Module.require (module.js:596:17)
at require (internal/module.js:11:18)
at Object.<anonymous> (E:\WebStormFile\treehole-manage\node_modules\sass-loader\lib\loader.js:3:14)
at Module._compile (module.js:652:30)
at Object.Module._extensions..js (module.js:663:10)
at Module.load (module.js:565:32)
at tryModuleLoad (module.js:505:12)
at Function.Module._load (module.js:497:3)
at Module.require (module.js:596:17)
at require (internal/module.js:11:18)
at loadLoader (E:\WebStormFile\treehole-manage\node_modules\loader-runner\lib\loadLoader.js:13:17)
at iteratePitchingLoaders (E:\WebStormFile\treehole-manage\node_modules\loader-runner\lib\LoaderRunner.js:1
69:2)
at iteratePitchingLoaders (E:\WebStormFile\treehole-manage\node_modules\loader-runner\lib\LoaderRunner.js:1
65:10)
at E:\WebStormFile\treehole-manage\node_modules\loader-runner\lib\LoaderRunner.js:173:18 @ ./node_modules/vue-style-loader!./node_modules/css-loader?{"sourceMap":false}!./node_modules/vue-loader/lib/
style-compiler?{"vue":true,"id":"data-v-1340bee1","scoped":true,"hasInlineConfig":false}!./node_modules/sass-lo
ader/lib/loader.js?{"sourceMap":false}!./node_modules/vue-loader/lib/selector.js?type=styles&index=0&bustCache!
./src/base/components/head.vue 4:14-395 13:3-17:5 14:22-403
@ ./src/base/components/head.vue
@ ./node_modules/babel-loader/lib!./node_modules/vue-loader/lib/selector.js?type=script&index=0&bustCache!./sr
c/module/home/page/home.vue
@ ./src/module/home/page/home.vue
@ ./src/module/home/router/index.js
@ ./src/base/router/index.js
@ ./src/main.js
@ multi (webpack)-dev-server/client?http://localhost:11001 webpack/hot/dev-server ./src/main.js
2、解决过程
1)使用命令“npm install node-sass --save-dev”下载一个新的 “node-sass”文件
“Module build failed: Error: Cannot find module 'node-sass'”的意思是找不到模块的‘node-sass’文件,所以你要做的是去下载一个‘node-sass’文件,好吧,报错了。仔细看了一下,并借鉴 https://blog.csdn.net/qq_38401285/article/details/86483278 这个博主踩的坑,然后我直接做了第二步。
E:\WebStormFile\treehole-manage>npm install node-sass --save-dev
npm ERR! code ECONNREFUSED
npm ERR! errno ECONNREFUSED
npm ERR! FetchError: request to https://registry.npm.taobao.org/node-sass failed, reason: connect ECONNREFUSED 127.0.0.1:1080
npm ERR! at ClientRequest.req.on.err (E:\WebStormFile\treehole-manage\node_modules\npm\node_modules\pacote\node_modules\make-fetch-happen\node_mo
.......
npm ERR! at <anonymous>
npm ERR! at process._tickCallback (internal/process/next_tick.js:188:7)
npm ERR! message: 'request to https://registry.npm.taobao.org/node-sass failed, reason: connect ECONNREFUSED 127.0.0.1:1080',
npm ERR! type: 'system',
npm ERR! errno: 'ECONNREFUSED',
npm ERR! code: 'ECONNREFUSED',
npm ERR! stack: 'FetchError: request to https://registry.npm.taobao.org/node-sass failed, reason: connect ECONNREFUSED 127.0.0.1:1080\n at Clien
.......
npm ERR!
npm ERR! If you are behind a proxy, please make sure that the npm ERR! 'proxy' config is set properly. See: 'npm help config'
+++》意思大概是 如果你在一个代理后面,请确保npm出错了代理服务器的配置设置正确。
.......
2)npm配置使用淘宝镜像 ‘npm config set registry http://registry.npm.taobao.org’
3)cnpm install node-sass --save,使用cnpm重新下载‘node-sass’文件
4)npm run dev ,重新运行项目。
vue项目报错,解决Module build failed: Error: Cannot find module 'node-sass' 问题的更多相关文章
- Module build failed: Error: Cannot find module 'url-loader' 的坑
本文地址:http://www.cnblogs.com/jying/p/8280956.html 开发环境:react.webpack.es5 引用图片报错:Module build failed: ...
- Module build failed: Error: Cannot find module 'node-sass'
安装npm 遇到 Module build failed: Error: Cannot find module 'node-sass' 这次通过重装 npm 完成 先卸载npm npm uninsta ...
- vue项目npm run dev 报错error in ./src/main.js Module build failed: Error: Cannot find module 'babel-plugin-syntax-jsx'
问题: vue 项目npm run dev运行时报错,如下图: 原因: 缺少相应的组件 解决办法: 安装相应组件: npm install babel-plugin-syntax-jsx --sav ...
- Module build failed: Error: Cannot find module 'babel-runtime/core-js/get-it
npm i babel-loader@7.1.5 -D
- vue-cli 报Module build failed: Error: No parser and no file path given, couldn't infer a parser.错的解决方法
出错提示如下: ERROR Failed to compile with errors :: error in ./src/App.vue Module build failed: Error: No ...
- vue.js报错:Module build failed: Error: No parser and no file path given, couldn't infer a parser.
ERROR Failed to compile with 2 errors 12:00:33 error in ./src/App.vue Module build failed: Error: No ...
- 配置web pack loader 报错:Module build failed: Error: The node API for `babel` has been moved to `babel-core`.
报错如下 Module build failed: Error: The node API for `babel` has been moved to `babel-core`. 在我配置loader ...
- npm run dev运行Vue项目报错:Node Sass does not yet support your current environment
导入Vue项目后,#npm run dev 报错: error in ./src/pages/hello.vue Module build failed: Error: Node Sass does ...
- Vue, element-ui Module build failed: Error: No PostCSS Config found
使用vue框架写pc页面时,我们经常会用到element-ui这个框架. 当我们吧把需要的东西都装在好运行项目的时候,有时会出现这样的错误, Module build failed: Error: N ...
随机推荐
- 关闭DELPHI 欢迎页
打开注册表 HKEY_CURRENT_USER\Software\Embarcadero\BDS\20.0\Known IDE Packages(20.0为版本号) 将$(BDS)\Bin\start ...
- div拖拽到iframe上方 导致 缩放和拖拽的不平滑和鼠标事件未放开 解决方法
思路一:用在开始进行缩放(触发了resizable的start事件)为iframe添加z-index属性,将iframe放置在最下层. $("#draggable").resiza ...
- slick轮播图使用大全
let oSlick = { dom: null, isMobile: false, slickInited: false, barInterval:null, currentSlide:, last ...
- lambda匿名函数和内置函数
对于简单的函数,也存在一种简便的表示方式,即:lambda表达式 定义函数(普通方式) def func(arg): return arg + 1 执行函数 result = fun ...
- MySQL主主模式
mysql主主复制配置: HOSTNAME IPADDR PORT节点1:my-prod01.oracle.com 192.168.10.97 3306 节点2:my-prod02.oracle.co ...
- weight(搜索对象的选取)
题目链接: 就是大概这么个东西 根据题意,我们可以清楚的知道:这个题我不会,这个题需要先将2n个数进行排序 这样每对于一个小的前(后)缀和总会在队列最前或队列最后 设这个数为k 那么判断总的Sum(n ...
- 在vue中如何引jquer
最近学习vue,习惯性的通过<script>标签引入jquery,写完后报错才想起来,这种方式在vue是不适用的. 1:因为已经安装了vue脚手架,所以需要在webpack中全局引入jqu ...
- 【C++进阶:STL常见性质2】
一般STL函数接收迭代器参数的规则为:[it1, it2) 左闭右开区间: vector<int> scores; scores.erase(scores.begin(),scores.e ...
- Django学习之路由系统
一.Django的路由系统 1.URLconf配置 基本格式: 参数说明: 2.正则表达式详解 基本配置 注意事项 补充说明 3.分组命名匹配 URLconf匹配的位置 捕获的参数永远都是字符串 视图 ...
- Free Pascal User’s Guide
https://www.freepascal.org/docs-html/current/user/user.html


