问题描述

Fatal error compiling: 无效的标记

maven启动错误。。版本号不对

<plugin>
<artifactId>maven-compiler-plugin</artifactId>
<configuration>
<source>${maven.compiler.source}</source>
<target>${maven.compiler.target}</target>
</configuration>
</plugin>

问题解决

检查:idea—- setting – maven – running – jdk

已解决!Fatal error compiling: 无效的标记(maven启动失败)的更多相关文章

  1. Fatal error compiling: 无效的标记: -parameters

    [INFO] BUILD FAILURE [INFO] ------------------------------------------------------------------------ ...

  2. Failed to execute goal org.apache.maven.plugins:maven-compiler-plugin:3.8.1:testCompile (default-testCompile) on project docker_springcloud_demo: Fatal error compiling: 无效的标记: -parameters -> [Help 1]

    [ERROR] Failed to execute goal org.apache.maven.plugins:maven-compiler-plugin:3.8.1:testCompile (def ...

  3. maven 编译出错Fatal error compiling: 无效的目标发行版: 1.8 -> [Help 1] 解决办法

    这几天在为公司项目搭建一个后台框架,使用的是eclipse-Mars自带的maven插件,在maven进行编译的时候,出现Fatal error compiling: 无效的目标发行版: 1.8 -& ...

  4. maven 启动 报错 Fatal error compiling: 无效的目标发行版

    http://news.tuxi.com.cn/news/119999990123162/31622105.html http://lyking2001.iteye.com/blog/837440 针 ...

  5. Fatal error compiling: 无效的目标发行版: 1.8 -> [Help 1] (zhuan)

    http://blog.csdn.net/z18137017273/article/details/53033613 ***************************************** ...

  6. Maven 错误:Failed to execute goal org.apache.maven.plugins:maven-compiler-plugin:3.1:compile (default-compile) on project appservice-common: Fatal error compiling: 无效的目标发行版: 1.8

    通过IDEA 提供的面板 执行package 或者 install 没有错误,但是cmd terminal 窗口就不行!出现: Maven 错误:Failed to execute goal org. ...

  7. maven:Fatal error compiling: 无效的目标发行版: 1.8.0_45 -> [Help 1]

    使用mvn clean install命令的时候出现如下的错误: Failed to execute goal org.apache.maven.plugins:maven-compiler-plug ...

  8. maven:Fatal error compiling: 无效的目标 发行版: 1.8 -> [Help 1]

    https://blog.csdn.net/kkgbn/article/details/72777750

  9. Fatal error compiling: java.lang.NoSuc hFieldError??

    用了两天时间,试了各种方法,问题最终解决.是JDK的版本问题:Maven3.5不支持jdk-9.0.1,最后退回:jdk1.8.0_151,问题圆满解决!! [ERROR] Failed to exe ...

随机推荐

  1. 主定理(Master Theorem)与时间复杂度

    1. 问题 Karatsuba 大整数的快速乘积算法的运行时间(时间复杂度的递推关系式)为 T(n)=O(n)+4⋅T(n/2),求其最终的时间复杂度. 2. 主定理的内容 3. 分析 所以根据主定理 ...

  2. 一个IP建多个Web站点

      TCP端口法 由于各种原因,我们有时候需要在一个IP地址上建立多个web站点,在IIS5中,我们可能通过简单的设 置达到这个目标. 在IIS中,每个 Web 站点都具有唯一的.由三个部分组成的标识 ...

  3. python3 随机生成6位数的验证码

    python3 随机生成6位数的验证码 要求是数字:0~9 及大小写字母. #!/usr/bin/env python # -*- coding:utf-8 -*- # Author:Hiuhung ...

  4. Windows下安装Resin及配置具体解释与公布应用

        关于Resin的优点,网上介绍了一大堆.小编经不住诱惑,决定试用一下. 眼下Resin的最新版本号为:4.0.40.能够从官网直接下载.     1. 将下载下来的Resin包解压开,会看到一 ...

  5. Scala基础知识

    1.scala的变量分为可变变量和不可变变量 不可变变量: val hello = "helloworld" 可变变量的定义方法 var str2 = "我是kw!&qu ...

  6. 安装orabbix

    须知: (1). orabbix使用root用户安装. (2). orabbix安装在zabbix server端,而不是安装在Oracle端.   1.下载 Orabbix   2. 解压软件 un ...

  7. error app/styles/components/iconfont.scss (Line 12: Invalid GBK character "\xE5")

    因为要用到iconfont,引入iconfont到sass文件后,出现编译sass文件错误,如下截图: 解决方法:在顶部设置编码格式 @charset "utf-8"; 编译成功!

  8. 【例题 6-7 UVA - 122 】Trees on the level

    [链接] 我是链接,点我呀:) [题意] 在这里输入题意 [题解] 二叉树的话,直接用数组存就好了. 写个bfs记录一下答案. [代码] #include <bits/stdc++.h> ...

  9. 【SPOJ 694】Distinct Substrings (更直接的求法)

    [链接]h在这里写链接 [题意] 接上一篇文章 [题解] 一个字符串所有不同的子串的个数=∑(len-sa[i]-height[i]) [错的次数] 0 [反思] 在这了写反思 [代码] #inclu ...

  10. ArcGIS Spatial Query

    Creates a spatial query which performs a spatial search for features in the supplied feature class a ...