[INFO] BUILD FAILURE
[INFO] ------------------------------------------------------------------------
[INFO] Total time: 2.796 s
[INFO] Finished at: --21T17::+:
[INFO] ------------------------------------------------------------------------
[ERROR] Failed to execute goal org.apache.maven.plugins:maven-compiler-plugin:3.7.:compile (default-compile) on project z-eureka: Fatal error compiling: 无效的标记: -parameters -> [Help
]
[ERROR]
[ERROR] To see the full stack trace of the errors, re-run Maven with the -e switch.
[ERROR] Re-run Maven using the -X switch to enable full debug logging.

这个是mvn 编译插件jdk 版本 和 项目配置的jdk 版本不一致。
我idea项目配置的是1.8 。但是 环境变量中java_home 是使用的1.7。Maven 是从java_home 中设置编译的jdk 路径,所以 mvn 的jdk 实际上是1.7  , 项目中设置的1.8 。

因为我其他项目中需要用户到1.7 所以我也没啥好办法,只能是临时改了 mvn 的 mvn.cmd 文件的java_home 配置

set JAVA_HOME=E:\JDK\JDK8

再次 mvn -version 查询版本 是1.8 。 再次使用 mvn clean package 打包成功。
如果还不成功,最好再看下,当前项目配置的 java compiler 版本

Fatal error compiling: 无效的标记: -parameters的更多相关文章

  1. Failed to execute goal org.apache.maven.plugins:maven-compiler-plugin:3.8.1:testCompile (default-testCompile) on project docker_springcloud_demo: Fatal error compiling: 无效的标记: -parameters -> [Help 1]

    [ERROR] Failed to execute goal org.apache.maven.plugins:maven-compiler-plugin:3.8.1:testCompile (def ...

  2. 已解决!Fatal error compiling: 无效的标记(maven启动失败)

    问题描述 Fatal error compiling: 无效的标记 maven启动错误..版本号不对 <plugin> <artifactId>maven-compiler-p ...

  3. maven 启动 报错 Fatal error compiling: 无效的目标发行版

    http://news.tuxi.com.cn/news/119999990123162/31622105.html http://lyking2001.iteye.com/blog/837440 针 ...

  4. Fatal error compiling: 无效的目标发行版: 1.8 -> [Help 1] (zhuan)

    http://blog.csdn.net/z18137017273/article/details/53033613 ***************************************** ...

  5. maven 编译出错Fatal error compiling: 无效的目标发行版: 1.8 -> [Help 1] 解决办法

    这几天在为公司项目搭建一个后台框架,使用的是eclipse-Mars自带的maven插件,在maven进行编译的时候,出现Fatal error compiling: 无效的目标发行版: 1.8 -& ...

  6. Maven 错误:Failed to execute goal org.apache.maven.plugins:maven-compiler-plugin:3.1:compile (default-compile) on project appservice-common: Fatal error compiling: 无效的目标发行版: 1.8

    通过IDEA 提供的面板 执行package 或者 install 没有错误,但是cmd terminal 窗口就不行!出现: Maven 错误:Failed to execute goal org. ...

  7. maven:Fatal error compiling: 无效的目标发行版: 1.8.0_45 -> [Help 1]

    使用mvn clean install命令的时候出现如下的错误: Failed to execute goal org.apache.maven.plugins:maven-compiler-plug ...

  8. maven:Fatal error compiling: 无效的目标 发行版: 1.8 -> [Help 1]

    https://blog.csdn.net/kkgbn/article/details/72777750

  9. Fatal error compiling: invalid target release: 11 -> [Help 1]

    <plugin> <groupId>org.apache.maven.plugins</groupId> <artifactId>maven-compi ...

随机推荐

  1. javascript不依赖JS加载顺序事件对象实现

    背景: 在现在WEB开发中,稍复杂一点的页面,都会涉及到多个模块,尤其是类似seajs.LABjs.requireJS等模块工具出来后,前端开发者分模块开发已经慢慢变成一种习惯了,但是多个模块间的常常 ...

  2. [转]SSIS: By coding

    本文转自:http://www.codeproject.com/Articles/604197/SSIS-By-coding Introduction SSIS better known as “SQ ...

  3. MySQL分库备份与分表备份

    MySQL分库备份与分表备份 1.分库备份 要求:将mysql数据库中的用户数据库备份,备份的数据库文件以时间命名 脚本内容如下: [root@db01 scripts]# vim backup_da ...

  4. [Android] Android工程以jar包形式向第三方应用提供服务

    参考: http://www.cnblogs.com/0616--ataozhijia/p/4094952.html 以API 19为例: 系统默认提供的 android.jar整体大小为: 21.8 ...

  5. X5平方速算法的证明

    X5代表15,25,35,45,55......以上变化的部分为X,如25这个数,X就等于2. X5平方数的速算法是这样:让X乘以X+1,后面写上25就是X5乘以X5的结果.比如25x25,先让2x3 ...

  6. java线程总结(4/5)

    转自:http://blog.csdn.net/qiaqia609/article/details/8067356 整理的一些关于线程的面试题目: 46.java中有几种方法可以实现一个线程?用什么关 ...

  7. iOS7重磅推新--不断尝试与重新设计的过程

    来源:GBin1.com iOS7重磅推新--不断尝试与重新设计的过程 或许你心里已经有了关于iPhone最新操作系统的评价,可能你喜欢它,也可能不喜欢,事实上大多数设计者不喜欢.设计界似乎一致认为I ...

  8. JBoss 系列十七:使用JGroups构建块MessageDispatcher 构建群组通信应用

    内容概要 本部分说明JGroups构建块接口MessageDispatcher,具体提供一个简单示例来说明如何使用JGroups构建块MessageDispatcher 构建群组通信应用 示例描述 构 ...

  9. vue - .postcssrc.js

    描述:添加浏览器私缀(私缀是上世纪90年代浏览器大战的产物,也是现在新型浏览器支持某些新API,而其它浏览器不支持的证明!) 我们看看App.vue 再来看看打包后的css文件 一切都是靠你postc ...

  10. 1000个经常使用的Python库和演示样例代码

    以下是programcreek.com通过分析大量开源码,提取出的最经常使用的python库. 1. sys    (4627) 2. os    (4088)  3. re    (3563)  4 ...