ubuntu 20.04 上安装 mmcv-full 时,无论是执行:

pip install mmcv-full

还是将 mmcv-full 项目克隆下来编译,均会出现问题。

百度无果,去必应上逛了一波,在 detectron2 项目下找到了解决方法,这个错误主要表明,当前电脑没有 g++ 模块,那么安装就好了。

ubuntu 上安装 g++ 的命令如下:

sudo apt-get install make gcc g++  
sudo apt-get install manpages-dev
# 或者使用下面的一步命令
# sudo apt-get install build-essential # 安装后,可以运行下面命令查看是否安装成功
g++ --version # 查看当前版本

参考:

https://github.com/facebookresearch/detectron2/issues/667

https://www.cnblogs.com/dragonsuc/p/4342472.html

[error]subprocess.CalledProcessError: Command '['which', 'g++']' returned non-zero exit status 1.的更多相关文章

  1. subprocess.CalledProcessError: Command ‘(‘lsb_release’, ‘-a’)’ returned non-zero exit status 1.

    解决方法find / -name lsb_releaserm -rf /usr/bin/lsb_release

  2. subprocess.CalledProcessError: Command '['ninja', '-v']' returned non-zero exit status 1.

    将anaconda环境下的  lib/python3.5/dist-packages/torch/utils/cpp_extension.py文件 将['ninja','-v']改成['ninja', ...

  3. Mac 无法安装安装psutil 报错 error: command '/usr/bin/clang' failed with exit status 1

    psutil是一个特别好用来检查系统资源的一个包, 但是 在Mac安装却总是报错 查看监控系统脚本, 点这里 mac系统版本: Macos Mojave 10.14.3 报错信息如下: WARNING ...

  4. yum 卸载 error: %preun(tengine-2.1.0-1.el6.x86_64) scriptlet failed, exit status 6

    error: %preun(tengine-2.1.0-1.el6.x86_64) scriptlet failed, exit status 6 Error in PREUN scriptlet i ...

  5. ubuntu 安装python3.7 以及安装pip3 出现Command '('lsb_release', '-a')' returned non-zero exit status 1问题解决

    最近因为电脑重装,东西全没了,总计一下最近重装环境的过程. 如果没有安装包,请下载: wget http://www.python.org/ftp/python/3.7.0/Python-3.7.0. ...

  6. error adding symbols: DSO missing from command line collect2: error: ld returned 1 exit status

    Windows服务器Azure云编译安装MariaDB教程 www.111cn.net 编辑:future 来源:转载 安装MariaDB数据库最多用于linux系统中了,下文给各位介绍在Window ...

  7. gcc/g++ 编译时出现:“对’xxxx’未定义的引用,collect2: error: ld returned 1 exit status” 的错误

    出现的问题: 在使用 make 编译实现一个程序时,出现了下面的错误.查看程序源文件所在的目录时发现程序已经完成了编译,并生成了 list_repo.o 的文件,说明是在程序链接生成可执行文件时发生了 ...

  8. 【Ubuntu升级python3.5到python3.6】dpkg-deb: error: subprocess paste was killed by signal (Broken pipe) Errors were encountered while processing: E: Sub-process /usr/bin/dpkg returned an error code (1) 问题解决

    Ubuntu16.04上将系统自带的python3.5升级到3.6 安装aioredis时提示Python版本需>=3.5.3,所以进行升级命令如下: $ sudo add-apt-reposi ...

  9. error: command 'cc' failed with exit status 1

    报错: Complete output from command /usr/bin/python -u -c "import setuptools, tokenize;__file__='/ ...

随机推荐

  1. 《剑指offer》面试题42. 连续子数组的最大和

    问题描述 输入一个整型数组,数组里有正数也有负数.数组中的一个或连续多个整数组成一个子数组.求所有子数组的和的最大值. 要求时间复杂度为O(n). 示例1: 输入: nums = [-2,1,-3,4 ...

  2. 通过HTML+CSS+JavaScript实现鼠标移动到页面顶部导航栏出现,如果移出导航栏3秒又隐藏起来,而且不受滚动条影响(二)

    通过HTML+CSS+JavaScript实现鼠标移动到页面顶部导航栏出现,如果移出导航栏3秒又隐藏起来,而且不受滚动条影响(二) 效果:默认一直隐藏导航栏,当滚动条滚到超过300px按钮出现,点击回 ...

  3. django_url配置

    前言 我们在浏览器访问一个网页是通过url地址去访问的,django管理url配置是在urls.py文件.当一个页面数据很多时候,通过会有翻页的情况,那么页数是不固定的,如:page=1.也就是url ...

  4. 「DP 浅析」斜率优化

    #0.0 屑在前面 将结合经典例题 「HNOI2008」玩具装箱 以及 「NOI2007」货币兑换 进行讲解. #1.0 简述 #1.1 适用情况 斜率优化一般适用于状态转移方程如下的 DP \[f_ ...

  5. gin中只绑定url查询字符串

    package main import ( "github.com/gin-gonic/gin" "log" ) type Person struct{ Nam ...

  6. django之“static”全局设置

    1. 首先要配置静态文件路径(这些文件不输入任何app):. # 设置静态文件读取路径(这些静态文件不属于任何app) STATICFILES_DIRS = [ os.path.join(BASE_D ...

  7. 计算机网络再次整理————tcp例子第二前奏[四]

    前言 前文我们介绍了网络协议的各层,同时也介绍了一下我们在编写代码时候的服务端的accept.bind.listen.connect.send做了什么. 可以说是从宏观的角度,或者代码开发的角度来说的 ...

  8. Python PyQt5 | Hi音乐 v3.0.0 正式版发布

    Hi音乐 两大平台全音乐搜索.收听与下载的简洁网络音乐播放器 中文介绍 | English Description 源码:Gitee 码云 简介 Hi音乐 是基于 Python 开发的简洁网络音乐播放 ...

  9. 「CTSC2006」歌唱王国

    概率生成函数\(g(x)=\sum_{i\geq 0}t_ix^i\),\(t_i\)表示结果为\(i\)的概率 令\(f(x)\)表示i位表示串结束时长度为i的概率,\(G(x)\)表示i位表示串长 ...

  10. java的本地文件操作

    一.文件的创建.删除和重命名 File file = new File("/bin/hello.txt");//文件无法被创建,系统找不到指定的路径file.createNewFi ...