Error:java.util.concurrent.ExecutionException: com.android.builder.internal.aapt.AaptException: 
\\?\C:\Users\Admin\.gradle\caches\transforms-\files-1.1\appcompat-v7-26.1..aar\a234c5f0534a8da0e4db0da7da7f3963
\res\drawable-mdpi-v4\abc_menu_hardkey_panel_mtrl_mult..png ERROR: Unable to open PNG file

Error:Execution failed for task ':domain:processDebugResources'.
> java.io.IOException: Could not delete path 'C:\fastwork\Projects\ComponentStudy-master\domain
\build\generated\source\r\debug\android'.
::18.397 [ERROR] [org.gradle.internal.buildevents.BuildExceptionReporter] FAILURE: Build failed with an exception.
::18.398 [ERROR] [org.gradle.internal.buildevents.BuildExceptionReporter]
::18.398 [ERROR] [org.gradle.internal.buildevents.BuildExceptionReporter] * What went wrong:
::18.398 [ERROR] [org.gradle.internal.buildevents.BuildExceptionReporter] Task 'compileDebug' is ambiguous in root project 'ComponentStudy-master'. Candidates
are: 'compileDebugAidl', 'compileDebugAndroidTestAidl', 'compileDebugAndroidTestJavaWithJavac', 'compileDebugAndroidTestNdk', 'compileDebugAndroidTestRenderscrip
t', 'compileDebugAndroidTestShaders', 'compileDebugAndroidTestSources', 'compileDebugJavaWithJavac', 'compileDebugNdk', 'compileDebugRenderscript', 'compileDebugS
haders', 'compileDebugSources', 'compileDebugUnitTestJavaWithJavac', 'compileDebugUnitTestSources'.
::18.399 [ERROR] [org.gradle.internal.buildevents.BuildExceptionReporter]
::18.400 [ERROR] [org.gradle.internal.buildevents.BuildExceptionReporter] * Try:
::18.400 [ERROR] [org.gradle.internal.buildevents.BuildExceptionReporter] Run gradlew tasks to get a list of available tasks.
::18.400 [ERROR] [org.gradle.internal.buildevents.BuildExceptionReporter]
::18.400 [ERROR] [org.gradle.internal.buildevents.BuildExceptionReporter] * Exception is:
::18.401 [ERROR] [org.gradle.internal.buildevents.BuildExceptionReporter] org.gradle.execution.TaskSelectionException: Task 'compileDebug' is ambiguous in roo
t project 'ComponentStudy-master'. Candidates are: 'compileDebugAidl', 'compileDebugAndroidTestAidl', 'compileDebugAndroidTestJavaWithJavac', 'compileDebugAndroid
TestNdk', 'compileDebugAndroidTestRenderscript', 'compileDebugAndroidTestShaders', 'compileDebugAndroidTestSources', 'compileDebugJavaWithJavac', 'compileDebugNdk
', 'compileDebugRenderscript', 'compileDebugShaders', 'compileDebugSources', 'compileDebugUnitTestJavaWithJavac', 'compileDebugUnitTestSources'.
::18.401 [ERROR] [org.gradle.internal.buildevents.BuildExceptionReporter] at org.gradle.execution.TaskSelector.getSelection(TaskSelector.java:)
::18.401 [ERROR] [org.gradle.internal.buildevents.BuildExceptionReporter] at org.gradle.execution.TaskSelector.getSelection(TaskSelector.java:)
FAILURE: Build failed with an exception.

* What went wrong:
Task 'debugRuntimeClasspath' not found in root project 'ComponentStudy-master'. * Try:
Run gradlew tasks to get a list of available tasks. Run with --info or --debug option to get more log output. * Exception is:
org.gradle.execution.TaskSelectionException: Task 'debugRuntimeClasspath' not found in root project 'ComponentStudy-master'.
at org.gradle.execution.TaskSelector.getSelection(TaskSelector.java:)
at org.gradle.execution.TaskSelector.getSelection(TaskSelector.java:)
at org.gradle.execution.commandline.CommandLineTaskParser.parseTasks(CommandLineTaskParser.java:)
at org.gradle.execution.TaskNameResolvingBuildConfigurationAction.configure(TaskNameResolvingBuildConfigurationAction.java:)
at org.gradle.execution.DefaultBuildConfigurationActionExecuter.configure(DefaultBuildConfigurationActionExecuter.java:)
at org.gradle.execution.DefaultBuildConfigurationActionExecuter.access$(DefaultBuildConfigurationActionExecuter.java:)
at org.gradle.execution.DefaultBuildConfigurationActionExecuter$.proceed(DefaultBuildConfigurationActionExecuter.java:)
at org.gradle.execution.DefaultTasksBuildExecutionAction.configure(DefaultTasksBuildExecutionAction.java:)
at org.gradle.execution.DefaultBuildConfigurationActionExecuter.configure(DefaultBuildConfigurationActionExecuter.java:)
at org.gradle.execution.DefaultBuildConfigurationActionExecuter.access$(DefaultBuildConfigurationActionExecuter.java:)
at org.gradle.execution.DefaultBuildConfigurationActionExecuter$.proceed(DefaultBuildConfigurationActionExecuter.java:)
at org.gradle.execution.ExcludedTaskFilteringBuildConfigurationAction.configure(ExcludedTaskFilteringBuildConfigurationAction.java:)
at org.gradle.execution.DefaultBuildConfigurationActionExecuter.configure(DefaultBuildConfigurationActionExecuter.java:)
at org.gradle.execution.DefaultBuildConfigurationActionExecuter.select(DefaultBuildConfigurationActionExecuter.java:)
at org.gradle.initialization.DefaultGradleLauncher$CalculateTaskGraph.run(DefaultGradleLauncher.java:)
at org.gradle.internal.progress.DefaultBuildOperationExecutor$RunnableBuildOperationWorker.execute(DefaultBuildOperationExecutor.java:)
at org.gradle.internal.progress.DefaultBuildOperationExecutor$RunnableBuildOperationWorker.execute(DefaultBuildOperationExecutor.java:)
at org.gradle.internal.progress.DefaultBuildOperationExecutor.execute(DefaultBuildOperationExecutor.java:)
at org.gradle.internal.progress.DefaultBuildOperationExecutor.run(DefaultBuildOperationExecutor.java:)
at org.gradle.initialization.DefaultGradleLauncher.constructTaskGraph(DefaultGradleLauncher.java:)
at org.gradle.initialization.DefaultGradleLauncher.doBuildStages(DefaultGradleLauncher.java:)
at org.gradle.initialization.DefaultGradleLauncher.executeTasks(DefaultGradleLauncher.java:)
at org.gradle.internal.invocation.GradleBuildController$.call(GradleBuildController.java:)
at org.gradle.internal.invocation.GradleBuildController$.call(GradleBuildController.java:)
at org.gradle.internal.work.DefaultWorkerLeaseService.withLocks(DefaultWorkerLeaseService.java:)
at org.gradle.internal.invocation.GradleBuildController.doBuild(GradleBuildController.java:)
at org.gradle.internal.invocation.GradleBuildController.run(GradleBuildController.java:)
at org.gradle.tooling.internal.provider.ExecuteBuildActionRunner.run(ExecuteBuildActionRunner.java:)
at org.gradle.launcher.exec.ChainingBuildActionRunner.run(ChainingBuildActionRunner.java:)
at org.gradle.tooling.internal.provider.ValidatingBuildActionRunner.run(ValidatingBuildActionRunner.java:)
at org.gradle.launcher.exec.RunAsBuildOperationBuildActionRunner$.run(RunAsBuildOperationBuildActionRunner.java:)
at org.gradle.internal.progress.DefaultBuildOperationExecutor$RunnableBuildOperationWorker.execute(DefaultBuildOperationExecutor.java:)
at org.gradle.internal.progress.DefaultBuildOperationExecutor$RunnableBuildOperationWorker.execute(DefaultBuildOperationExecutor.java:)
at org.gradle.internal.progress.DefaultBuildOperationExecutor.execute(DefaultBuildOperationExecutor.java:)
at org.gradle.internal.progress.DefaultBuildOperationExecutor.run(DefaultBuildOperationExecutor.java:)
at org.gradle.launcher.exec.RunAsBuildOperationBuildActionRunner.run(RunAsBuildOperationBuildActionRunner.java:)
at org.gradle.tooling.internal.provider.SubscribableBuildActionRunner.run(SubscribableBuildActionRunner.java:)
at org.gradle.launcher.exec.InProcessBuildActionExecuter.execute(InProcessBuildActionExecuter.java:)
at org.gradle.launcher.exec.InProcessBuildActionExecuter.execute(InProcessBuildActionExecuter.java:)
at org.gradle.launcher.exec.BuildTreeScopeBuildActionExecuter.execute(BuildTreeScopeBuildActionExecuter.java:)
at org.gradle.launcher.exec.BuildTreeScopeBuildActionExecuter.execute(BuildTreeScopeBuildActionExecuter.java:)
at org.gradle.tooling.internal.provider.ContinuousBuildActionExecuter.execute(ContinuousBuildActionExecuter.java:)
at org.gradle.tooling.internal.provider.ContinuousBuildActionExecuter.execute(ContinuousBuildActionExecuter.java:)
at org.gradle.tooling.internal.provider.ServicesSetupBuildActionExecuter.execute(ServicesSetupBuildActionExecuter.java:)
at org.gradle.tooling.internal.provider.ServicesSetupBuildActionExecuter.execute(ServicesSetupBuildActionExecuter.java:)
at org.gradle.tooling.internal.provider.GradleThreadBuildActionExecuter.execute(GradleThreadBuildActionExecuter.java:)
at org.gradle.tooling.internal.provider.GradleThreadBuildActionExecuter.execute(GradleThreadBuildActionExecuter.java:)
at org.gradle.tooling.internal.provider.ParallelismConfigurationBuildActionExecuter.execute(ParallelismConfigurationBuildActionExecuter.java:)
at org.gradle.tooling.internal.provider.ParallelismConfigurationBuildActionExecuter.execute(ParallelismConfigurationBuildActionExecuter.java:)
at org.gradle.tooling.internal.provider.StartParamsValidatingActionExecuter.execute(StartParamsValidatingActionExecuter.java:)
at org.gradle.tooling.internal.provider.StartParamsValidatingActionExecuter.execute(StartParamsValidatingActionExecuter.java:)
at org.gradle.tooling.internal.provider.SessionFailureReportingActionExecuter.execute(SessionFailureReportingActionExecuter.java:)
at org.gradle.tooling.internal.provider.SessionFailureReportingActionExecuter.execute(SessionFailureReportingActionExecuter.java:)
at org.gradle.tooling.internal.provider.SetupLoggingActionExecuter.execute(SetupLoggingActionExecuter.java:)
at org.gradle.tooling.internal.provider.SetupLoggingActionExecuter.execute(SetupLoggingActionExecuter.java:)
at org.gradle.launcher.daemon.server.exec.ExecuteBuild.doBuild(ExecuteBuild.java:)
at org.gradle.launcher.daemon.server.exec.BuildCommandOnly.execute(BuildCommandOnly.java:)
at org.gradle.launcher.daemon.server.api.DaemonCommandExecution.proceed(DaemonCommandExecution.java:)
at org.gradle.launcher.daemon.server.exec.WatchForDisconnection.execute(WatchForDisconnection.java:)
at org.gradle.launcher.daemon.server.api.DaemonCommandExecution.proceed(DaemonCommandExecution.java:)
at org.gradle.launcher.daemon.server.exec.ResetDeprecationLogger.execute(ResetDeprecationLogger.java:)
at org.gradle.launcher.daemon.server.api.DaemonCommandExecution.proceed(DaemonCommandExecution.java:)
at org.gradle.launcher.daemon.server.exec.RequestStopIfSingleUsedDaemon.execute(RequestStopIfSingleUsedDaemon.java:)
at org.gradle.launcher.daemon.server.api.DaemonCommandExecution.proceed(DaemonCommandExecution.java:)
at org.gradle.launcher.daemon.server.exec.ForwardClientInput$.call(ForwardClientInput.java:)
at org.gradle.launcher.daemon.server.exec.ForwardClientInput$.call(ForwardClientInput.java:)
at org.gradle.util.Swapper.swap(Swapper.java:)
at org.gradle.launcher.daemon.server.exec.ForwardClientInput.execute(ForwardClientInput.java:)
at org.gradle.launcher.daemon.server.api.DaemonCommandExecution.proceed(DaemonCommandExecution.java:)
at org.gradle.launcher.daemon.server.exec.LogAndCheckHealth.execute(LogAndCheckHealth.java:)
at org.gradle.launcher.daemon.server.api.DaemonCommandExecution.proceed(DaemonCommandExecution.java:)
at org.gradle.launcher.daemon.server.exec.LogToClient.doBuild(LogToClient.java:)
at org.gradle.launcher.daemon.server.exec.BuildCommandOnly.execute(BuildCommandOnly.java:)
at org.gradle.launcher.daemon.server.api.DaemonCommandExecution.proceed(DaemonCommandExecution.java:)
at org.gradle.launcher.daemon.server.exec.EstablishBuildEnvironment.doBuild(EstablishBuildEnvironment.java:)
at org.gradle.launcher.daemon.server.exec.BuildCommandOnly.execute(BuildCommandOnly.java:)
at org.gradle.launcher.daemon.server.api.DaemonCommandExecution.proceed(DaemonCommandExecution.java:)
at org.gradle.launcher.daemon.server.exec.StartBuildOrRespondWithBusy$.run(StartBuildOrRespondWithBusy.java:)
at org.gradle.launcher.daemon.server.DaemonStateCoordinator$.run(DaemonStateCoordinator.java:)
at org.gradle.internal.concurrent.ExecutorPolicy$CatchAndRecordFailures.onExecute(ExecutorPolicy.java:)
at org.gradle.internal.concurrent.ManagedExecutorImpl$.run(ManagedExecutorImpl.java:)
at org.gradle.internal.concurrent.ThreadFactoryImpl$ManagedThreadRunnable.run(ThreadFactoryImpl.java:) * Get more help at https://help.gradle.org BUILD FAILED in 12s

http://blog.csdn.net/runner__1/article/details/53482565

AAPTEXECPTION的更多相关文章

随机推荐

  1. CRM 2016 IFrame_A嵌入 EXT.net 页面 a.aspx,刷新另一IFrame_B嵌入 b.aspx gird.

    说白了就是一个IFrame页面,执行另一IFrame页面的函数.  a.aspx JS: parent.Xrm.Page.getControl("IFRAME_B").getObj ...

  2. 电商系统架构总结1(EF)

    最近主导了一个电商系统的设计开发过程,包括前期分析设计,框架搭建,功能模块的具体开发(主要负责在线支付部分),成功上线后的部署维护,运维策略等等全过程. 虽然这个系统不是什么超大型的电商系统 数亿计的 ...

  3. C,Java,C#数据类型对比总结

  4. js中基本数据类型和引用数据类型的区别

    1.基本数据类型和引用数据类型 ECMAScript包括两个不同类型的值:基本数据类型和引用数据类型. 基本数据类型指的是简单的数据段,引用数据类型指的是有多个值构成的对象. 当我们把变量赋值给一个变 ...

  5. Java 9 - Java Number类

    Java Number类 一般地,当需要使用数字的时候,我们通常使用内置数据类型,如:byte.int.long.double等. 实例 int i = 5000; float gpa = 13.65 ...

  6. Ramdisk虚拟内存盘,Swap分区

    虚拟内存盘是通过软件将一部分内存(RAM)模拟为硬盘来使用的一种技术.相对于直接的硬盘文件访问来说,这种技术可以极大的提高在其上进行的文件访问的速度.但是RAM的易失性也意味着当关闭电源后这部分数据将 ...

  7. solr7.4 tomcat环境下搭建(windows)

    -版本solr-7.4.0 -环境 Windows  jdk1.8 -启动方式:部署在apache-tomcat-8.5.28,以下简称Tomcat 1. 将solr-7.4.0\server\sol ...

  8. 前端笔记二:CSS盒模型

    1.标准模型和IE模型 2.标准模型和IE模型的区别 标准模型的height和width只是content的: IE模型的height和width是包含padding和border的 3.CSS如何设 ...

  9. Html标签及各种属性(持续更新)

    <!--Html标签属性之:required (必须的)--> <input type="file" id="Images" required ...

  10. Python——列表深浅拷贝

    一.深浅拷贝 如果希望将列表复制一份,通过列表的内置方法copy就可以实现: s = [[1,2],3,4] s1 = s.copy() print(s) print(s1) 拷贝出的列表s1与原列表 ...