使用maven创建project时碰到如下错误:

D:\codes\JSF>mvn archetype:create -DgroupId=com.tutorialspoint.test -DartifactId=helloworld -DarchetypeArtifactId=maven-archetype-webapp

[INFO] Scanning for projects...

[INFO]

[INFO] ------------------------------------------------------------------------

[INFO] Building Maven Stub Project (No POM) 1

[INFO] ------------------------------------------------------------------------

[INFO]

[INFO] --- maven-archetype-plugin:2.3:create (default-cli) @ standalone-pom ---

[INFO] ------------------------------------------------------------------------

[INFO] BUILD FAILURE

[INFO] ------------------------------------------------------------------------

[INFO] Total time: 2.392 s

[INFO] Finished at: 2015-08-03T16:06:11+08:00

[INFO] Final Memory: 13M/152M

[INFO] ------------------------------------------------------------------------

[ERROR] Failed to execute goal org.apache.maven.plugins:maven-archetype-plugin:2

.3:create (default-cli) on project standalone-pom: Unable to parse configuration
  of mojo org.apache.maven.plugins:maven-archetype-plugin:2.3:create for paramete

r #: Cannot create instance of interface org.apache.maven.artifact.repository.Ar

tifactRepository -> [Help 1]

[ERROR]

[ERROR] To see the full stack trace of the errors, re-run Maven with the -e switch.

[ERROR] Re-run Maven using the -X switch to enable full debug logging.

[ERROR]

[ERROR] For more information about the errors and possible solutions, please read the following articles:

[ERROR] [Help 1] http://cwiki.apache.org/confluence/display/MAVEN/PluginConfigurationException

解决方法:将命令中的create改为generate:

mvn archetype:generate -DgroupId=com.tutorialspoint.test -DartifactId=helloworld -DarchetypeArtifactId=maven-archetype-webapp

failed to execute goal org.apache.maven.plugins:maven-archetype-plugin错误解决方法的更多相关文章

  1. maven install Failed to execute goal org.apache.maven.plugins:maven-war-plugin:2.1.1:war (default-war) on project web_nanchang

    maven打包成war时,报错:Failed to execute goal org.apache.maven.plugins:maven-war-plugin:2.1.1:war (default- ...

  2. Failed to execute goal org.apache.maven.plugins:maven-antrun-plugin:1.7:run (dist) on project hadoop-kms: An Ant BuildException has occured

    编译cdh版hadoop2.5.0出现的问题 系统: CentOs66 64位 JDK:1.7 Maven: 3.0.5 Protobuf: libprotoc 2.5.0 编译命令: mvn pac ...

  3. Failed to execute goal org.apache.maven.plugins:maven-compiler-plugin:3.1:compile (default-compile) on project LogTest: Compilation failure -> [Help 1]

      [ERROR] Failed to execute goal org.apache.maven.plugins:maven-compiler-plugin:3.1:compile (default ...

  4. [ERROR] Failed to execute goal org.apache.maven.plugins:maven-install-plugin:2.3.1:

    security-sdk-1.0.jar已经存在于D:/secServerSDK-test/src/main/resources/lib下 报错如下: xxxxxx@xxxxxxxx /d/secSe ...

  5. [ERROR] Failed to execute goal org.apache.maven.plugins:maven-archetype-plugin:2.4:create (default-cli) on project standalone-pom: Unable to parse configuration of 3: mojo org.apache.maven.plugins:

    问题: [ERROR] Failed to execute goal org.apache.maven.plugins:maven-archetype-plugin:2.4:create (defau ...

  6. [ERROR] Failed to execute goal org.apache.maven.plugins:maven-jar-plugin:2.3.1:jar (default-jar) on

    [ERROR] Failed to execute goal org.apache.maven.plugins:maven-jar-plugin:2.3.1:jar (default-jar) on ...

  7. maven install 报错Failed to execute goal org.apache.maven.plugins:maven-compiler-plugin:3.1:compile (default-compile) on project*****

    [ERROR]Failed to execute goal org.apache.maven.plugins:maven-compiler-plugin:3.1:compile (default-co ...

  8. Maven Failed to execute goal org.apache.maven.plugins:maven-clean-plugin:2.5:clean Failed to delete access_log

    I'm trying to run simple struts project using maven and tomcat. When I'm trying to exucute next goal ...

  9. 解决Failed to execute goal org.apache.maven.plugins

    1.Maven构建失败 Failed to execute goal org.apache.maven.plugins:maven-compiler-plugin: 2.3 . 2 :compile  ...

  10. Failed to execute goal org.apache.maven.plugins:maven-compiler-plugin:3.1:compile 解决办法

    Maven install失败 Failed to execute goal org.apache.maven.plugins:maven-compiler-plugin:3.1:compile (d ...

随机推荐

  1. 如何使用fastJson来解析JSON格式数据和生成JSON格式数据

    由于项目用到了JSON格式的数据,在网上搜索到了阿里的fastjson比较好用,特此记录fastjson用法,以备以后查询之用. decode: 首先创建一个JSON解析类: public class ...

  2. autofac 遇到构造函数问题

    None of the constructors found with 'aaaaa' on type ' aaa' can be invoked with the available service ...

  3. jvm内存溢出的三种情况以及解决办法

    1       前言相信有一定java开发经验的人或多或少都会遇到OutOfMemoryError的问题,这个问题曾困扰了我很长时间,随着解决各类问题经验的积累以及对问题根源的探索,终于有了一个比较深 ...

  4. gcc&g++

    原文章 误区一:gcc只能编译c代码,g++只能编译c++代码两者都可以,但是请注意:1.后缀为.c的,gcc把它当作是C程序,而g++当作是c++程序:后缀为.cpp的,两者都会认为是c++程序,注 ...

  5. iOS之创建CocoaPods公有库教程

    简介 在开发过程中,经常会使用到第三框架,我们通过一个pod install命令,很方便的就将第三方框架加到我们自己的项目中. 如果我们也想将自己写的组件或库开源出去,让别人也可以通过pod inst ...

  6. 从javaweb项目学习

    1.sql语句 在insert语句中需要插入查询出来的值. Insert into a (a1,a2,a3) values (1,select num from b where id=1,3) 这样写 ...

  7. gvim -- 跳转命令,查找格式,正则

    1.跳转命令 ‘w'单词前进,'b'单词后退,'e'单词前进,‘ge’单词后退,存在单词词首词尾区别,'W''B''E''gE'将不以单词区分,以空格区分 ‘$’行尾,'^'非空白行首,'0'行首 ‘ ...

  8. JAVA 数据库编程中的性能优化

    1. 禁止自动提交:在默认情况下,程序执行的任何sql 语句都是自动提交的向一个表中插入2000条记录,自动提交所用的时间  11666毫秒禁止自动提交(显示提交) 3450毫秒 2. 批处理:多用批 ...

  9. WPF中播放视频音频

    首先要在WPF中播放视频和音频,我们就需要用到MediaElement控件,下面我们示例播放音频和视频. 用MediaElement播放音频: 第一步:将你需要播放的音频(mp3)放在你WPF项目的D ...

  10. C#中Lock关键字的使用

    C# 中的 Lock 语句通过隐式使用 Monitor 来提供同步功能.lock 关键字在块的开始处调用 Enter,而在块的结尾处调用 Exit. 通常,应避免锁定 public 类型,否则实例将超 ...