解决方案是:

先用命令: npm -v 查看下你的版本(我原来是 V3.1 不行)

然后用 cnpm install -g npm  更新版本

npm - v

变成最新的4.0.4

npm run dev 可以用了!

npm run dev 报错 版本太低的更多相关文章

  1. vue项目初始化时npm run dev报错webpack-dev-server解决方法

    vue项目初始化时npm run dev报错webpack-dev-server解决方法 原因:这是新版webpack存在的BUG,卸载现有的新版本webpack,装老版本就好webpack-dev- ...

  2. nuxt.js 初始化 npm run dev 报错

    在初始化 npm install 了基本依赖后: npm run dev 报错: error in ./server/index.js Module build failed: Error: Plug ...

  3. 巨坑npm run dev 报错 终于找到正确答案 Error: EPERM: operation not permitted, open '/data/public/build/css/add.p

    Windows10环境 npm run dev 报错  终于找到正确答案 Error: EPERM: operation not permitted, open '/data/public/build ...

  4. npm run dev 报错 iview TypeError [ERR_INVALID_CALLBACK]: Callback must be a function

    运行npm run dev报这个错 然后找到 D:\text\vue\iview-admin\build\webpack.dev.config.js打开 将这一行代码: fs.write(fd, bu ...

  5. npm run dev 报错:Error: Cannot find module 'webpack-cli/bin/config-yargs'

    使用 npm run dev 时报错: Error: Cannot find module 'webpack-cli/bin/config-yargs' 原因是找不到webpack-cli这个包,使用 ...

  6. Vue 项目: npm run dev 报错 webpack-dev-server

    从码云上下载vue项目,运行npm run dev 时报错: > webpack-dev-server --inline --progress --config build/webpack.de ...

  7. vue项目,npm install后,npm run dev报错问题

    报错: ERR! code ELIFECYCLE npm ERR! errno 1 npm ERR! metools@1.0.0 dev: `node build/dev-server.js` npm ...

  8. vue npm run dev 报错 semver\semver.js:312 throw new TypeError('Invalid Version: ' + version)

    npm run dev运行报错信息如下图: 原因分析: 版本问题 解决办法: 在semver.js(node_modules/semver/semver.js)里做了一些改动,代码如下: // if ...

  9. npm run dev 报错 run `npm audit fix` to fix them, or `npm audit` for details

    前几天写的直接运行npm run dev还是ok的,突然不行了,前面报错是css-loader没有,删除style标签上的lang='scss'就好了,先不需要这个依赖.这个先不管. 只是后面的 ru ...

随机推荐

  1. spoj IITWPC4F - Gopu and the Grid Problem 线段树

    IITWPC4F - Gopu and the Grid Problem no tags  Gopu is interested in the integer co-ordinates of the ...

  2. Cannot set property 'onclick' of null的问题

    转载自: https://my.oschina.net/ximidao/blog/351017 摘要: 测试点击事件的时候浏览器报错,提示Uncaught TypeError: Cannot set ...

  3. sklearn中的train_test_split (随机划分训练集和测试集)

    官方文档:http://scikit-learn.org/stable/modules/generated/sklearn.model_selection.train_test_split.html ...

  4. 大数据 - spark-sql 常用命令

    --spark启动 spark-sql --退出 spark-sql> quit; --退出spark-sql or spark-sql> exit; 1.查看已有的database sh ...

  5. 第 6 章 存储 - 044 - volume 生命周期管理

    volume 生命周期管理 1)备份 因为 volume 实际上是 host 文件系统中的目录和文件,所以 volume 的备份实际上是对文件系统的备份 例如:本地的Registry,所有镜像都存在/ ...

  6. Feign二: @FeignClient 接口调用

    在项目的启动文件加入:@EnableFeignClients 注解, import org.springframework.boot.SpringApplication; import org.spr ...

  7. HTTP Status 405 - HTTP method GET is not supported by this URL

    问题概述: 借助MyEclipse直接建立了一个Servlet类,每次访问这个Servlet都能访问.可自己建立一个Servlet为什么总提示:HTTP Status 405 - HTTP metho ...

  8. liunx之用户管理

    用户管理 ==============================================================groupadd,groupdeluseradd,usermod, ...

  9. yarn hadoop-2.3.0 installation cluster Centos 64bits

    Apache Hadoop -2.2.0 - How to Install a Three Nodes Cluster http://tonylixu.blogspot.ca/2014/02/apac ...

  10. 『Python × C++』函数传参机制学习以及对比

    一.Python函数传参 在python中,函数传参实际上传入的是变量的别名,由于python内在的变量机制(名称和变量值相互独立),只要传入的变量不可变(tuple中的元素也要是不可变的才行),那么 ...