Discovery starting.
*** RUN ABORTED ***
java.lang.RuntimeException: Unable to load a Suite class that was discovered in the runpath: org.apache.spark.util.MutableURLClassLoaderSuite
at org.scalatest.tools.DiscoverySuite$.getSuiteInstance(DiscoverySuite.scala:84)
at org.scalatest.tools.DiscoverySuite$$anonfun$1.apply(DiscoverySuite.scala:38)
at org.scalatest.tools.DiscoverySuite$$anonfun$1.apply(DiscoverySuite.scala:37)
at scala.collection.TraversableLike$$anonfun$map$1.apply(TraversableLike.scala:234)
at scala.collection.TraversableLike$$anonfun$map$1.apply(TraversableLike.scala:234)
at scala.collection.Iterator$class.foreach(Iterator.scala:893)
at scala.collection.AbstractIterator.foreach(Iterator.scala:1336)
at scala.collection.IterableLike$class.foreach(IterableLike.scala:72)
at scala.collection.AbstractIterable.foreach(Iterable.scala:54)
at scala.collection.TraversableLike$class.map(TraversableLike.scala:234)
...
Cause: java.lang.NullPointerException:
at org.apache.spark.TestUtils$.createCompiledClass(TestUtils.scala:142)
at org.apache.spark.TestUtils$.createCompiledClass(TestUtils.scala:168)
at org.apache.spark.TestUtils$$anonfun$2.apply(TestUtils.scala:65)
at org.apache.spark.TestUtils$$anonfun$2.apply(TestUtils.scala:64)
at scala.collection.TraversableLike$$anonfun$map$1.apply(TraversableLike.scala:234)
at scala.collection.TraversableLike$$anonfun$map$1.apply(TraversableLike.scala:234)
at scala.collection.immutable.List.foreach(List.scala:381)
at scala.collection.TraversableLike$class.map(TraversableLike.scala:234)
at scala.collection.immutable.List.map(List.scala:285)
at org.apache.spark.TestUtils$.createJarWithClasses(TestUtils.scala:64)
...
[INFO] ------------------------------------------------------------------------
[INFO] BUILD FAILURE
[INFO] ------------------------------------------------------------------------
[INFO] Total time: 02:00 min
[INFO] Finished at: 2018-05-08T17:34:42+08:00
[INFO] Final Memory: 78M/825M
[INFO] ------------------------------------------------------------------------
[ERROR] Failed to execute goal org.scalatest:scalatest-maven-plugin:1.0:test (test) on project spark-core_2.11: There are test failures -> [Help 1]
[ERROR]
[ERROR] To see the full stack trace of the errors, re-run Maven with the -e switch.
[ERROR] Re-run Maven using the -X switch to enable full debug logging.
[ERROR]
[ERROR] For more information about the errors and possible solutions, please read the following articles:
[ERROR] [Help 1] http://cwiki.apache.org/confluence/display/MAVEN/MojoFailureException
Java HotSpot(TM) 64-Bit Server VM warning: ignoring option MaxPermSize=512M; support was removed in 8.0

  

错误2:

[INFO] BUILD FAILURE
[INFO] ------------------------------------------------------------------------
[INFO] Total time: 06:18 min
[INFO] Finished at: 2018-05-09T16:28:40+08:00
[INFO] Final Memory: 59M/1296M
[INFO] ------------------------------------------------------------------------
[ERROR] Failed to execute goal org.apache.maven.plugins:maven-surefire-plugin:2.20.1:test (default-test) on project spark-core_2.11: There are test failures.
[ERROR]
[ERROR] Please refer to D:\...\core\target\surefire-reports for the individual test results.
[ERROR] Please refer to dump files (if any exist) [date]-jvmRun[N].dump, [date].dumpstream and [date]-jvmRun[N].dumpstream.
[ERROR] -> [Help 1]
[ERROR]
[ERROR] To see the full stack trace of the errors, re-run Maven with the -e switch.
[ERROR] Re-run Maven using the -X switch to enable full debug logging.
[ERROR]
[ERROR] For more information about the errors and possible solutions, please read the following articles:
[ERROR] [Help 1] http://cwiki.apache.org/confluence/display/MAVEN/MojoFailureException
Java HotSpot(TM) 64-Bit Server VM warning: ignoring option MaxPermSize=512M; support was removed in 8.0

  

未解决。

用idea+maven编译打包spark project core错误:java.lang.RuntimeException: Unable to load a Suite class的更多相关文章

  1. 解决Spark用Maven编译时报Exception in thread "main" java.lang.OutOfMemoryError: PermGen space异常

    异常截图: 解决方法: export MAVEN_OPTS="-Xmx2g -XX:MaxPermSize=512M -XX:ReservedCodeCacheSize=512m"

  2. spark java.lang.OutOfMemoryError: unable to create new native thread

    最近迁移集群,在hadoop-2.8.4 的yarn上跑 spark 程序 报了以下错误 java.lang.OutOfMemoryError: unable to create new native ...

  3. maven打包错误:java.lang.IllegalStateException: Unable to find a @SpringBootConfiguration, you need to use @ContextConfiguration or @SpringBootTest(classes=...) with your test

    Tests run: 1, Failures: 0, Errors: 1, Skipped: 0, Time elapsed: 0.118 sec <<< FAILURE! - in ...

  4. myeclipse 无法启动 java.lang.IllegalStateException: Unable to acquire application service. Ensure that the org.eclipse.core.runtime bundle is resolved and started (see config.ini).

    把myeclipse10 按照目录完整拷贝到了另外一台电脑, 另外的目录 原安装目录 D\:\soft\i\myeclipse10 新安装目录 E\:\soft\myeclipse10 双击启动失败, ...

  5. [JAVA][RCP]Clean project之后报错:java.lang.RuntimeException: No application id has been found.

    Clean了一下Project,然后就报了如下错误 !ENTRY com.release.nattable.well_analysis 2 0 2015-11-20 17:04:44.609 !MES ...

  6. maven报错 java.lang.RuntimeException: com.google.inject.CreationException: Unable to create injector, see the following errors

    2 errors java.lang.RuntimeException: com.google.inject.CreationException: Unable to create injector, ...

  7. maven web 项目中启动报错 Java.lang.ClassNotFoundException: org.springframework.web.servlet.DispatcherServlet

    主要原因是maven项目里面的jar包吗,没有导入到项目中 maven web 项目中启动报错 Java.lang.ClassNotFoundException: org.springframewor ...

  8. java.lang.RuntimeException: Class "org.apache.maven.cli.MavenCli$CliRequest" not found

    IDEA版本:14.1 maven版本:apache-maven-3.3.9-bin IDEA的maven项目,在pom文件执行Maven--Reimport,引入jar包依赖,报错java.lang ...

  9. spark提示Caused by: java.lang.ClassCastException: scala.collection.mutable.WrappedArray$ofRef cannot be cast to [Lscala.collection.immutable.Map;

    spark提示Caused by: java.lang.ClassCastException: scala.collection.mutable.WrappedArray$ofRef cannot b ...

随机推荐

  1. Bean Query 第一个版本号(1.0.0)已公布

    BeanQuery 是一个把对象转换为Map的Java工具库. 支持选择Bean中的一些属性.对结果进行排序和依照条件查询. 不只能够作用于顶层对象,也能够作用于子对象.很多其它具体的介绍能够看我的博 ...

  2. Struts2中ValueStack结构和总结

    [ValueStack和ActionContext的关系] 首先,从结构上来看ValueStack是ActionContext的一个组成部分,是对ActionContext功能的扩展.ActionCo ...

  3. js实现加密(?!)

    <script src="yourUrl/md5.min.js"></script> 或者: <script src="http://cdn ...

  4. mysql12----explain

    explain 可以帮助我们在不真正执行某个sql语句时,就执行mysql怎样执行,这样利用我们去分析sql指令.尽量避免全表扫描. Id: SELECT识别符.这是SELECT的查询序列号 ) \G ...

  5. Android 6.0 RK3288 ROM编译详解+命令详解【转】

    本文转载自:http://blog.csdn.net/MLQ8087/article/details/58607692 Android 6.0 RK3288 ROM编译详解+命令详解 原创 2017年 ...

  6. Ubuntu如何定时清理内存

    Ubuntu如何定时清理内存 1.进入su jiqing@Ubuntu:~$ su 密码: root@Ubuntu:/home/jiqing# 2.创建cleanCache.sh #!/bin/bas ...

  7. unbantu16.04安装jdk

    1,解压缩jdk到指定目录 2,修改目录,方便使用 3,配置环境变量 sudo gedit /etc/environment 末尾加入以下配置(JAVA_HOME 后的路径就是jdk的文件位置) PA ...

  8. 小程序-demo:小程序示例

    ylbtech-小程序-demo:小程序示例     1.返回顶部 0. 1.app.js const openIdUrl = require('./config').openIdUrl App({ ...

  9. less 语法

    1 变量 less的变量使用@开头 1.1 demo @colorRed:red; @colorBlue:blue; .demo{ color:@colorRed; background-color: ...

  10. 3.ExtJs常用布局--layout详解(含实例)

    转自:https://blog.csdn.net/fifteen718/article/details/51482826