Tests run: 1, Failures: 0, Errors: 1, Skipped: 0, Time elapsed: 0.118 sec <<< FAILURE! - in com.example.demo.RosApplicationTests
initializationError(com.example.demo.RosApplicationTests)  Time elapsed: 0.01 sec  <<< ERROR!
java.lang.IllegalStateException: Unable to find a @SpringBootConfiguration, you need to use @ContextConfiguration or @SpringBootTest(classes=...) with your test
    at org.springframework.util.Assert.state(Assert.java:70)
    at org.springframework.boot.test.context.SpringBootTestContextBootstrapper.getOrFindConfigurationClasses(SpringBootTestContextBootstrapper.java:202)
    at org.springframework.boot.test.context.SpringBootTestContextBootstrapper.processMergedContextConfiguration(SpringBootTestContextBootstrapper.java:137)
    at org.springframework.test.context.support.AbstractTestContextBootstrapper.buildMergedContextConfiguration(AbstractTestContextBootstrapper.java:409)
    at org.springframework.test.context.support.AbstractTestContextBootstrapper.buildDefaultMergedContextConfiguration(AbstractTestContextBootstrapper.java:323)
    at org.springframework.test.context.support.AbstractTestContextBootstrapper.buildMergedContextConfiguration(AbstractTestContextBootstrapper.java:277)
    at org.springframework.test.context.support.AbstractTestContextBootstrapper.buildTestContext(AbstractTestContextBootstrapper.java:112)
    at org.springframework.boot.test.context.SpringBootTestContextBootstrapper.buildTestContext(SpringBootTestContextBootstrapper.java:82)
    at org.springframework.test.context.TestContextManager.<init>(TestContextManager.java:120)
    at org.springframework.test.context.TestContextManager.<init>(TestContextManager.java:105)
    at org.springframework.test.context.junit4.SpringJUnit4ClassRunner.createTestContextManager(SpringJUnit4ClassRunner.java:152)
    at org.springframework.test.context.junit4.SpringJUnit4ClassRunner.<init>(SpringJUnit4ClassRunner.java:143)
    at org.springframework.test.context.junit4.SpringRunner.<init>(SpringRunner.java:49)
    at sun.reflect.NativeConstructorAccessorImpl.newInstance0(Native Method)
    at sun.reflect.NativeConstructorAccessorImpl.newInstance(NativeConstructorAccessorImpl.java:62)
    at sun.reflect.DelegatingConstructorAccessorImpl.newInstance(DelegatingConstructorAccessorImpl.java:45)
    at java.lang.reflect.Constructor.newInstance(Constructor.java:423)
    at org.junit.internal.builders.AnnotatedBuilder.buildRunner(AnnotatedBuilder.java:104)
    at org.junit.internal.builders.AnnotatedBuilder.runnerForClass(AnnotatedBuilder.java:86)
    at org.junit.runners.model.RunnerBuilder.safeRunnerForClass(RunnerBuilder.java:59)
    at org.junit.internal.builders.AllDefaultPossibilitiesBuilder.runnerForClass(AllDefaultPossibilitiesBuilder.java:26)
    at org.junit.runners.model.RunnerBuilder.safeRunnerForClass(RunnerBuilder.java:59)
    at org.junit.internal.requests.ClassRequest.getRunner(ClassRequest.java:33)
    at org.apache.maven.surefire.junit4.JUnit4Provider.execute(JUnit4Provider.java:283)
    at org.apache.maven.surefire.junit4.JUnit4Provider.executeWithRerun(JUnit4Provider.java:173)
    at org.apache.maven.surefire.junit4.JUnit4Provider.executeTestSet(JUnit4Provider.java:153)
    at org.apache.maven.surefire.junit4.JUnit4Provider.invoke(JUnit4Provider.java:128)
    at org.apache.maven.surefire.booter.ForkedBooter.invokeProviderInSameClassLoader(ForkedBooter.java:203)
    at org.apache.maven.surefire.booter.ForkedBooter.runSuitesInProcess(ForkedBooter.java:155)
    at org.apache.maven.surefire.booter.ForkedBooter.main(ForkedBooter.java:103)
打包项目时提醒出现如上的错误

根据分析发现我的main中的类的包名更改过,

修改成一致

maven打包错误:java.lang.IllegalStateException: Unable to find a @SpringBootConfiguration, you need to use @ContextConfiguration or @SpringBootTest(classes=...) with your test的更多相关文章

  1. SpringBoot测试类启动错误 java.lang.IllegalStateException: Unable to find a @SpringBootConfiguration, you need to use @ContextConfiguration or @SpringBootTest(classes=...) with your test

    报错 java.lang.IllegalStateException: Unable to find a @SpringBootConfiguration, you need to use @Cont ...

  2. java.lang.IllegalStateException: Unable to find a @SpringBootConfiguration, you need to use @ContextConfiguration or @SpringBootTest(classes=...) with your test

    写了一个单元测试test来启动activiti,controller放在src/main/java根目录下,test对应也放在src/test/java下,结果报错: java.lang.Illega ...

  3. springboot测试启动报错java.lang.IllegalStateException: Unable to find a @SpringBootConfiguration, you need to use @ContextConfiguration or @SpringBootTest(classes=...) with your test

    springboot测试启动报错: java.lang.IllegalStateException: Unable to find a @SpringBootConfiguration, you ne ...

  4. 使用SpringBoot整合MybatisPlus出现 : java.lang.IllegalStateException: Unable to find a @SpringBootConfiguration, you need to use @ContextConfiguration or @SpringBootTest(classes=...) with your test

    解决方案一: 将测试类的包路径改为和主启动类的一致 解决方法二: 不想改测试类的路径 就在测试类上添加要测试的类的classes

  5. java.lang.IllegalStateException Unable to find a @SpringBootConfiguration错误解决方案

    问题描述:java.lang.IllegalStateException: Unable to find a @SpringBootConfiguration, you need to use @Co ...

  6. Unable to find a @SpringBootConfiguration, you need to use @ContextConfiguration or @SpringBootTest(classes=...) with your test java.lang.IllegalStateException

    不能找到对应的带有@SpringBootConfiguration 的类,你需要将它放在包的最顶层.

  7. myeclipse 无法启动 java.lang.IllegalStateException: Unable to acquire application service. Ensure that the org.eclipse.core.runtime bundle is resolved and started (see config.ini).

    把myeclipse10 按照目录完整拷贝到了另外一台电脑, 另外的目录 原安装目录 D\:\soft\i\myeclipse10 新安装目录 E\:\soft\myeclipse10 双击启动失败, ...

  8. tomcat启动时检测到循环继承而栈溢出的问题:Caused by: java.lang.IllegalStateException: Unable to complete the scan for annotations for web application [/test] due to a StackOverflowError. Possible root causes include

    最近在公司更新一个老项目的时候,发现部署项目后tomcat报错,错误如下: Caused by: java.lang.IllegalStateException: Unable to complete ...

  9. Caused by: java.lang.IllegalStateException: Unable to complete the scan for annotations for web application [/Cppcc] due to a StackOverflowError. Possible root causes include a too low setting for -Xs

    解决办法:(1)修改D:\Java\apache-tomcat-7.0.88\conf\catalina.properties (122line) (2)如org.apache.catalina.st ...

随机推荐

  1. 用Go语言异常机制模拟TryCatch异常捕捉

    有的同学看到Go和TryCatch一起出现,心里可能会说,难道Go语言升级了,加入了try...catch语句.哈哈,其实Go语言从创建之初就没打算加入try...catch语句,因为创建Go的那帮大 ...

  2. 一步步完成“迷你版” 的ASP.NET Core框架

    一 前言 Artech 分享了 200行代码,7个对象--让你了解ASP.NET Core框架的本质 . 用一个极简的模拟框架阐述了ASP.NET Core框架最为核心的部分. 这里一步步来完成这个迷 ...

  3. CodeForces 41A+43A【课上无聊刷水题系列】

    41Acode 好像只要前一个字符串存在下一个字符串的头单词就YES: #include <bits/stdc++.h> using namespace std; typedef __in ...

  4. php 发送邮件(实例)

    html部分 <!DOCTYPE html> <html> <head> <title></title> <script type=& ...

  5. Unity2D研究院之自动生成动画、AnimationController、Prefab(一)

    http://www.xuanyusong.com/archives/3243 国庆了,回家了.时刻还是要吃一颗学习的心,在家了也要抽出时间好好学习一下.之前MOMO一直没研究过Unity2D,今天研 ...

  6. bzoj 2395: [Balkan 2011]Timeismoney【计算几何+最小生成树】

    妙啊,是一个逼近(?)的做法 把两个值最为平面上的点坐标,然后答案也是一个点. 首先求出可能是答案的点xy分别是按照c和t排序做最小生成树的答案,然后考虑比这两个点的答案小的答案,一定在xy连线靠近原 ...

  7. CF939D Love Rescue

    题意 给定两个长度为n的由小写字母组成的字符串 每次可以花费1的代价,指定两个字母,把其中一个全部变为另一个 求使两个字符串相同的最小花费 n <= 100000 因为谁变成谁没有关系反正相等就 ...

  8. 洛谷P3306 [SDOI2013]随机数生成器(BSGS)

    传送门 感觉我BSGS都白学了……数学渣渣好像没有一道数学题能自己想出来…… 要求$X_{i+1}=aX_i+b\ (mod \ \ p)$ 左右同时加上$\frac{b}{a-1}$,把它变成等比数 ...

  9. [HNOI2010] 弹飞绵羊 bounce

    标签:分块.题解: 200000,而且标号从0开始,很符合分块的条件啊.看看怎么实现. 首先分成√n个区间,然后如果我们对于每一个位置i,求出一个Next[i]和step[i],分别表示跳到的后一个位 ...

  10. android videoView 加载等待

    final Handler handler = new Handler(); Runnable runnable = new Runnable() { public void run() { int ...