javacTask: 源发行版 1.8 需要目标发行版 1.8
[INFO] -------------------------------------------------------------
[ERROR] COMPILATION ERROR :
[INFO] -------------------------------------------------------------
[ERROR] An unknown compilation problem occurred
[INFO] 1 error
[INFO] -------------------------------------------------------------
[INFO] ------------------------------------------------------------------------
[INFO] BUILD FAILURE
[INFO] ------------------------------------------------------------------------
[INFO] Total time: 1.409 s
[INFO] Finished at: 2019-04-16T15:27:55+08:00
[INFO] Final Memory: 7M/20M
[INFO] ------------------------------------------------------------------------
[ERROR] Failed to execute goal org.apache.maven.plugins:maven-compiler-plugin:3.1:compile (default-compile) on project scala-bi-server: Compilation failure
[ERROR] An unknown compilation problem occurred
[ERROR] -> [Help 1]
[ERROR]
[ERROR] To see the full stack trace of the errors, re-run Maven with the -e switch.
[ERROR] Re-run Maven using the -X switch to enable full debug logging.
[ERROR]
[ERROR] For more information about the errors and possible solutions, please read the following articles:
[ERROR] [Help 1] http://cwiki.apache.org/confluence/display/MAVEN/MojoFailureException Process finished with exit code 1

在pom.xml 加入编译插件

	<plugins>
<!--compiler插件-->
<plugin>
<groupId>org.apache.maven.plugins</groupId>
<artifactId>maven-compiler-plugin</artifactId>
<version>3.3</version>
<configuration>
<source>1.8</source>
<target>1.8</target>
<encoding>${file.encoding}</encoding>
</configuration>
</plugin>
</plugins>

  

Idea maven编译报错 javacTask: 源发行版 1.8 需要目标发行版 1.8的更多相关文章

  1. Idea_编译报错 javacTask: 源发行版 1.6 需要目标发行版 1.6

    在idea中编译时发生如下的错误 Information:Using javac 1.7.0_75 to compile java sources Information:java: javacTas ...

  2. [Intellij] 编译报错 javacTask

    报错信息: Idea 编译报错 javacTask: 源发行版 1.6 需要目标发行版 1.6 解决方案:

  3. maven编译报错 -source 1.5 中不支持 lambda 表达式

    在用maven编译项目是由于项目中用了jdk 1.8, 编译是报错  -source 1.5 中不支持 lambda 表达式,Google找到这篇解决方案,记录一下: 编译时报如下错误: [ERROR ...

  4. maven编译报错 -source 1.5 中不支持 lambda 表达式(转)

    原文链接:http://blog.csdn.net/kai161/article/details/50379418 在用maven编译项目是由于项目中用了jdk 1.8, 编译是报错  -source ...

  5. maven编译报错 -source 1.5 中不支持 lambda(或diamond) 表达式,编码 UTF-8 的不可映射字符

    在用maven编译项目是由于项目中用了jdk 1.8, 编译是报错  -source 1.5 中不支持 lambda 表达式. 错误原因: Maven Compiler 插件默认会加 -source ...

  6. SpringBoot MAVEN编译报错Failed to execute goal org.apache.maven.plugins:maven-compiler-plugin:3.8.0:

    参考了好几篇文章没搞定,直到查询错误关键字 An unknown compilation problem occurred 分别参考了以下博客: https://blog.csdn.net/fanre ...

  7. JDK 7升8 maven 编译报错

    在JDK由版本7升级到8时,使用maven编译会报doc错误,原因是JAVA8不支持JAVA7编写的doc,报错信息如下: @param name 未找到 @return 的用法无效 可以使添加配置- ...

  8. 无法访问mybatis.dto.StudengInVO-使用maven编译报错-2022新项目

    一.问题由来 最近一次拉代码后,合并代码然后进行编译时出现一个问题,使用maven在进行编译的时候报一个错,无法访问mybatis.dto.StudengInVO. 突然出现这个错误让自己感觉很奇怪, ...

  9. maven 编译报错 “找不到符号”

    报错如下: E:\workspace\iccardcore\mis\src\main\java\com\hxsmart\sicard\core\webapp\action\process\DayEnd ...

随机推荐

  1. tomcat启动报错:java.lang.IllegalArgumentException: Document base D:\apache-tomcat-6.0.45\webapps\activiti-explorer does not exist or is not a readable directory

    java.lang.IllegalArgumentException: Document base D:\apache-tomcat-6.0.45\webapps\erp does not exist ...

  2. javascript总结26:Date

    1 获取Date对象 Date-引用类型,JavaScript中的内置对象 获取当前时间 var date = new Date(); //UTC的时间 //返回数字,时间的毫秒形式 var date ...

  3. Word 2010发布博客文章(修正)

    目前大部分的博客作者在写博客这件事情上都会遇到以下3个痛点:1.所有博客平台关闭了文档发布接口,用户无法使用Word,Windows Live Writer等工具来发布博客.2.发布到博客或公众号平台 ...

  4. <a>标签的用法以及[@text_cut]

    <a href="${a.url}" target="_blank">[@text_cut s=a.title len=titLen append= ...

  5. .net 任务(Task)

    1. Task (任务): 很容易调用 ThreadPool.QueueUserWorkItem 实现异步操作,但是这个技术有许多 .net 引入Task类型来使用任务. 如下几种方式都是实现异步的方 ...

  6. ML.NET 0.9 版本发布---.net下的机器学习引擎

    欢迎来到 2019年!在过去的9个月里, 我们一直在为ML.NET添加新的特征和改进相关功能.在提交1.0版本之前,我们将专注于包的整体稳定性并对API进行不断优化, 扩大测试的覆盖面并对开发文档进行 ...

  7. 【Selenium专题】WebDriver启动firefox浏览器

    firefox浏览器不需要下载驱动,原生支持,以下是代码运行环境,firefox启动封装在方法startFirefox()中 import org.openqa.selenium.WebDriver; ...

  8. system idle process

    偶然发现windows环境任务管理其中存在进程 system idle process,cpu占用极大但内存占用很小.google了一下,保存下结果 system idle process :系统空闲 ...

  9. Mysql内置功能《五》 函数

    一 函数 MySQL中提供了许多内置函数,例如: 一.数学函数 ROUND(x,y) 返回参数x的四舍五入的有y位小数的值 RAND() 返回0到1内的随机值,可以通过提供一个参数(种子)使RAND( ...

  10. 30.Rotate Image(矩阵旋转)

    Level:   Medium 题目描述: You are given an n x n 2D matrix representing an image. Rotate the image by 90 ...