SpringBoot MAVEN编译报错Failed to execute goal org.apache.maven.plugins:maven-compiler-plugin:3.8.0:
参考了好几篇文章没搞定,直到查询错误关键字
An unknown compilation problem occurred
分别参考了以下博客:
https://blog.csdn.net/fanrenxiang/article/details/80864908
https://blog.csdn.net/weixin_42167717/article/details/80377123
最后搞定的是这篇
https://my.oschina.net/u/170632/blog/857078
An unknown compilation problem occurred
maven 编译项目遇到
里面我引用了jdk的jar,遇到上面那个报错
<plugin>
<artifactId>maven-compiler-plugin</artifactId>
<version>3.6.0</version>
<configuration>
<source>1.8</source>
<target>1.8</target>
<encoding>UTF-8</encoding>
<compilerArguments>
<verbose />
<!-- 要注意 win是冒号,linux/Mac OS是分号,-->
<bootclasspath>${java.home}/lib/rt.jar:${java.home}/lib/jce.jar</bootclasspath>
</compilerArguments>
</configuration>
</plugin>
注意代码中的文字,就是解决办法
SpringBoot MAVEN编译报错Failed to execute goal org.apache.maven.plugins:maven-compiler-plugin:3.8.0:的更多相关文章
- maven install 报错Failed to execute goal org.apache.maven.plugins:maven-compiler-plugin:3.1:compile (default-compile) on project*****
[ERROR]Failed to execute goal org.apache.maven.plugins:maven-compiler-plugin:3.1:compile (default-co ...
- maven install 报错 Failed to execute goal org.apache.maven.plugins:maven-surefire-plugin:2.12.4:test
pom文件引入以下依赖 <plugin> <groupId>org.apache.maven.plugins</groupId> <artifactId> ...
- mvn install 报错Failed to execute goal org.apache.maven.plugins:maven-compiler-plugin:2.3.2 错误: 找不到符号
报错信息 在Eclipse中执行mvn install时,console端显示如下报错信息: [ERROR] Failed to execute goal org.apache.maven.plugi ...
- 安装maven工程报错"Failed to execute goal on project...Could not resolve dependencies for project..."
我在qingcheng_interface中Lifecycle目录下执行install命令后报错"Failed to execute goal on project...Could not ...
- maven build时报错Failed to execute goal org.apache.maven.plugins:maven-surefire-plugin:2.12.4:test
[INFO] BUILD FAILURE [INFO] ------------------------------------------------------------------------ ...
- maven install时报错 Failed to execute goal org.apache.maven.plugins:maven-surefire-plugin:2.12.4:test (default-test)
今天在一个maven项目上执行maven install命令的时候一直报错,错误信息如下: [INFO] ----------------------------------------------- ...
- maven install报错 Failed to execute goal on project my-manager-mapper: Could not resolve dependencies for project com.my:my-manager-mapper:jar:0.0.1-SNAPSHOT:
报错信息为: [ERROR] Failed to execute goal on project my-manager-mapper: Could not resolve dependencies f ...
- maven install时报错Failed to execute goal org.apache.maven.plugins:maven-compiler-plugin:2.3.2:compile
首先检查父项目,子项目的jdk版本是否一致,编码格式是否一致我的问题就错在了编码格式上,父项目用的是UTF-8,子项目新建的,默认GBK这时,使用maven install命令出错 提示:[INFO] ...
- 启动Maven项目时报错Failed to execute goal org.apache.maven.plugins:maven-clean-plugin:2.5:clean (default-clean) on project **-web: Failed to clean project: Failed to delete E:\**\target\tomcat\logs\access_lo
这类错误 出现这种错误,通常是由于您已启动了另一个tomcat 进程或者运行的javaw.exe进程,导致报错. 解决方法: 1. 鼠标点击 X 进行关闭运行失败的 Console页,(如果运行多次, ...
随机推荐
- MyBatis日记(五):一对一关系,一对多关系
一对一关系: 首先在数据库中新增地址表(t_address)用于存储人员的地址信息: CREATE TABLE `t_address` ( `id` ) NOT NULL AUTO_INCREMENT ...
- 串口通信编程向导 Serial Programming Guide for POSIX Operating Systems
https://www.cmrr.umn.edu/~strupp/serial.html#CONTENTS Introduction Chapter 1, Basics of Serial Commu ...
- Gtest:死亡测试
转自:玩转Google开源C++单元测试框架Google Test系列(gtest)之五 - 死亡测试 一.前言 “死亡测试”名字比较恐怖,这里的“死亡”指的的是程序的崩溃.通常在测试过程中,我们需要 ...
- 解决pycharm导入pygame包问题
在正确用pip命令安装好pygame后, 运行pycharm仍然会报错找不到pygame包, 这时候我们可以用pycharm自带的工具安装好pygame包,操作步骤如下: 点击设置,(或者ctrl+a ...
- Gerrit 服务器入门使用-项目的创建与克隆
Gerrit 服务器入门使用-项目的创建与克隆 作者:尹正杰 版权声明:原创作品,谢绝转载!否则将追究法律责任. 一.创建克隆项目 1>.点击"BROWSE" 2>.点 ...
- 安装nginx环境(含lua)时遇到报错ngx_http_lua_common.h:20:20: error: luajit.h: No such file or directory的解决
下面是安装nginx+lua环境时使用的相关模块及版本,ngx_devel_kit和lua-nginx-module模块用的都是github上最新的模块.并进行了LuaJIT的安装. #Install ...
- httprunner学习1-环境与登录接口案例
前言 HttpRunner 是一款面向 HTTP(S) 协议的通用测试框架,只需编写维护一份 YAML/JSON 脚本,即可实现自动化测试. 具有以下优点: 继承 Requests 的全部特性,轻松实 ...
- 分析和研究Monkey Log文件
Log 在Android中的地位非常重要,要是作为一个android程序员不能过分析log这关,算是android没有入门吧 . 下面我们就来说说如何处理log文件 . 什么时候会有Log文件的产生 ...
- WebPack探索之路(1)
1. 卸载全局的webpack npm ininstall webpack webpack-cli -g 其中安装webpack-cli 是可以让webpack在命令行中执行.在webpack4.0中 ...
- mysql数据库的concat(),group_concat(),concat_ws()函数,三者之间的比较
今天在写项目的时候,看到同事使用group_concat()函数 和concat_ws()函数,这两个函数和普通的concat()函数之间到底有什么不同. 我使用的数据库是mysql数据库. GROU ...