BUG:给Nexus7编译Android4.2的时候出现 fatal error: map: No such file or directory
情况是这样的,某人最近入手一台nexus7,于是在cyanogenmod 将nexus7的原代码下载到本地,编译环境是UBUNTU 12,04
然后编译的时候,出现了如下的错误导致编译失败
<pre><code>target arm C++: libwebrtc_system_wrappers <= external/webrtc/src/system_wrappers/source/map.cc
In file included from external/webrtc/src/system_wrappers/source/map.cc:11:0:external/webrtc/src/system_wrappers/source/../interface/map_wrapper.h:14:15: fatal error: map: No such file or directory compilation terminated.
make: *** [out/target/product/generic/obj/STATIC_LIBRARIES/libwebrtc_system_wrappers_intermediates/map.o] Error 1
make: *** Waiting for unfinished jobs....</code></pre>
仔细一看,原来是webrtc编译出错,原因大概是因为编译的时候找不到c++的STL库而失败。
而我的编译环境里面是有STL 的,经过一番google之后,发现问题的原因是webrt编译脚本里面的一个bug,webrtc会检查是否你在环境变量里面定义过NDK_ROOT这个变量,如果定义了的话webrtc会找不到STL的头文件。。。。真是很诡异的bug
解决方法就是在环境变量里面,export NDK_ROOT = “” 然后重新编译
参考资料 http://stackoverflow.com/questions/11978919/android-building-fatal-error-map-no-such-file
原文地址:http://www.douban.com/note/261089625/
BUG:给Nexus7编译Android4.2的时候出现 fatal error: map: No such file or directory的更多相关文章
- 编译C++,找不到头文件(fatal error: string: No such file or directory)
在androidproject中编译C++时,找不到头文件,报错例如以下: fatal error: string: No such file or directory 解决该问题须要在Android ...
- 编译boost程序出现如下错误fatal error LNK1104: cannot open file 'libboost_system-vc100-mt-gd-1_54.lib'的解决方法
对于如下程序: #include <iostream> #include <boost/asio.hpp> #include <boost/date_time/posix ...
- 【Redis】编译错误zmalloc.h:50:31: fatal error: jemalloc/jemalloc.h: No such file or directory
[Redis]编译错误zmalloc.h:50:31: fatal error: jemalloc/jemalloc.h: No such file or directory 在安装redis进行编译 ...
- 10.29 工作笔记 ndk编译C++,提示找不到头文件(ndk-build error: string: No such file or directory)
ndk编译C++.提示找不到头文件(ndk-build error: string: No such file or directory) 被这个问题弄得愁眉苦脸啊.心想为啥一个string都找不到呢 ...
- VS2010编译VS2008工程时,LINK : fatal error LNK1123: failure during conversion to COFF: file invalid or corrupt
1.问题 电脑上同时安装了VS2008,VS2010,使用VS2010编译VS2008建立的工程,或者,VS2010创建新的工程.编译时,出现以下链接错误: LINK : fatal error LN ...
- 编译APR包报错 rm: cannot remove `libtoolT': No such file or directory
centos 6 编译APR包报错 在当前apr 目录 : #Vi configure +31880 ,注释掉此行 再次编译即可.
- mac编译openssl扩展报错 openssl.c:44:10: fatal error: 'openssl/evp.h' file not found
解决办法 brew link openssl --force 然后 ./configure --with-openssl --with-php-config=/usr/local/php/bin/ph ...
- VS2010遇到fatal error C1083: 无法打开预编译头文件:“xxx.pch”: No such file or directory
对C++和VS2010非常不熟悉,但是无奈赶着项目,只能看了点基础就上手,然后就碰到这个问题了. 原因分析: http://bbs.csdn.net/topics/340191697?page=1 编 ...
- Ubuntu12.04编译Android4.0.1源码全过程-----附wubi安装ubuntu编译android源码硬盘空间不够的问题解决
昨晚在编译源码,make一段时间之后报错如下: # A fatal error has been detected by the Java Runtime Environment: # # SIGSE ...
随机推荐
- jquery和css3实现的很酷的菜单导航
今天为大家带来的是jquery和css3实现的不错的导航菜单.点击列表图表后,内容页面向内移动显示菜单项.当单击关闭菜单按钮时,菜单项隐藏,内容页恢复原位.看下图 在线预览 源码下载 我们看下实现 ...
- Java类型的生命周期
以上就是我今天没有总结学习类加载器时候对类加载器仅有的知识,虽然有个大概印象,但是还是有点模糊.今天一口气总结一下,参考文献我就不列举了.本文不生产知识,只是知识的搬运工. 静态.class文件到内存 ...
- [转]Python Web部署方式总结
学过PHP的都了解,php的正式环境部署非常简单,改几个文件就OK,用FastCgi方式也是分分钟的事情.相比起来,Python在web应用上的部署就繁杂的多,主要是工具繁多,主流服务器支持不足,在了 ...
- POJ 1523 SPF 割点与桥的推断算法-Tarjan
题目链接: POJ1523 题意: 问一个连通的网络中有多少个关节点,这些关节点分别能把网络分成几部分 题解: Tarjan 算法模板题 顺序遍历整个图,能够得到一棵生成树: 树边:可理解为在DFS过 ...
- Logrotate日志轮巡missingok: 在日志轮循期间,任何错误将被忽略
Linux日志文件总管——logrotate 编译自:http://xmodulo.com/2014/09/logrotate-manage-log-files-linux.html ...
- 關於 WebClient wc = new WebClient() 下載第三方數據不能進安安信任異常
報錯異常:The underlying connection was closed: Could not establish trust relationship for SSL/TLS secure ...
- MATLAB中常用的排列、组合、阶乘函数
1.求n的阶乘,方法如下:a.factorial(n)b.gamma(n+1)c.v='n!'; vpa(v) 2.求组合(数),方法如下:a.combntns(x,m) 列举出从n个元素中取出 ...
- Qt 线程基础(QThread、QtConcurrent等)
[-] 使用线程 何时使用其他技术替代线程 应该使用 Qt 线程的哪种技术 Qt线程基础 QObject与线程 使用互斥量保护数据的完整 使用事件循环防止数据破坏 处理异步执行 昨晚看Qt的Manua ...
- eclipse的Maven项目pom.xml错误信息提示missingxxxjar解决方案
今天在学习的时候需要用到maven工程,当时找完所依赖的包的三要素就开始下载了,写完pom.xml需要一段时间下载这些jar包,就躺在一边等了.可能是笔记本有节能功能这个原因导致我醒来时断网发现满屏m ...
- 关于win7下安卓开发环境的搭建
一.下载安装JDK(不用配置环境变量) 1.先卸载原来存在的JDK 控制面板-卸载程序-有两个软件(Java SE Development Kit 8 Update 101(64-bit)和Java ...