(1)安装到68%时出现弹出框

Error in invoking target 'install' of makefile '/home/oracle/app/oracle/product/11.2.0/dbhome_1/ctx/lib/ins_ctx.mk'. See '/home/oracle/oraInventory/logs/installActions2014-05-21_02-20-57PM.log' for details.
 解决方案:

编辑创建脚本:

# Fix ctx/lib/ins_ctx.mk

ORACLE_HOME=/u01/app/oracle/product/11.2./db_1

cat << __EOF__ > /tmp/memcpy_wrap.c
#include <stddef.h>
#include <string.h> asm (".symver wrap_memcpy, memcpy@GLIBC_2.14");
void *wrap_memcpy(void *dest, const void *src, size_t n) {
return memcpy(dest, src, n);
}
__EOF__ if [[ -e "${ORACLE_HOME}/ctx/lib/ins_ctx.mk" ]]; then
sed -i -e 's/\$(INSO_LINK)/\$(INSO_LINK) -Wl,--wrap=memcpy_wrap \$(ORACLE_HOME)\/ctx\/lib\/memcpy_wrap.o/g' ${ORACLE_HOME}/ctx/lib/ins_ctx.mk
gcc -c /tmp/memcpy_wrap.c -o ${ORACLE_HOME}/ctx/lib/memcpy_wrap.o && rm /tmp/memcpy_wrap.c
fi

运行脚本 并点击retry

下载路径及傻瓜式操作步骤下载链接:

(2)安装到70%多时出现弹出框

Error in invoking target 'agent nmhs' of makefile '/u01/app/oracle/product/11.2.0/db_1/sysman/lib/ins_emagent.mk'. See '/u01/app/oraInventory/logs/installActions2015-04-23_01-23-30PM.log' for details.

解决方案:编辑创建脚本:

# Fix sysman/lib/ins_emagent.mk

ORACLE_SRC_INSTALL_DIR=/media/sf_uxora_share/database
cd ${ORACLE_SRC_INSTALL_DIR}/stage/Components jar_file=
for i_file in $( ls ./oracle.sysman.agent/*/1/DataFiles/filegroup*.jar ); do
unzip -l ${i_file} sysman/lib/ins_emagent.mk 2>&1 1>/dev/null
[[ $? -eq 0 ]] && jar_file=${i_file} && break
done unzip ${jar_file} sysman/lib/ins_emagent.mk 2>&1 1>/dev/null
if [[ $? -eq 0 ]]; then
sed -i -e 's/\$(MK_EMAGENT_NMECTL)/\$(MK_EMAGENT_NMECTL) -lnnz11/g' sysman/lib/ins_emagent.mk
jar -uvf ${jar_file} sysman/lib/ins_emagent.mk
fi

运行脚本 并点击retry

下载路径及傻瓜式操作步骤下载链接:

(3)解决linux的-bash: ./xx: Permission denied

-bash: ./xx.sh: Permission denied
解决:
chmod 777 xx.sh

Linux chmod +755和chmod +777 各是什么意思呢?

755 代表用户对该文件拥有读,写,执行的权限,同组其他人员拥有执行和读的权限,没有写的权限,其他用户的权限和同组人员权限一样。
777代表,user,group ,others ,都有读写和可执行权限。

(4)安装Oracle,运行Database Configuration Assistant卡住

关闭防火墙即可

//临时关闭防火墙,重启后会重新自动打开
systemctl restart firewalld
//检查防火墙状态
firewall-cmd --state
firewall-cmd --list-all
//Disable firewall
systemctl disable firewalld
systemctl stop firewalld
systemctl status firewalld
//Enable firewall
systemctl enable firewalld
systemctl start firewalld
systemctl status firewalld

In this article ...
... "Fix prior install" needs jar binary. Install it with the following command:

$ yum -y install java-devel

memcpy error in ins_ctx.mk

Operating System: Oracle Enterprise Linux 7
Oracle version: 11.2.0.1

Error output

INFO: gcc -o ctxhx -m64 -L/u01/app/oracle/product/11.2./db_1/ctx/lib/ -L/u01/app/oracle/product/11.2./db_1/lib/ -L/u01/app/oracle/product/11.2./db_1/lib/stubs/  /u01/app/oracle/product/11.2./db_1/ctx/lib/ctxhx.o -L/u01/app/oracle/product/11.2./db_1/ctx/lib/ -lm -lsc_fa -lsc_ex -lsc_da -lsc_ca -lz  -lctxhx -Wl,-rpath,/u01/app/oracle/product/11.2./db_1/ctx/lib -lsnls11 -lnls11  -lcore11 -lsnls11 -lnls11 -lcore11 -lsnls11 -lnls11 -lxml11 -lcore11 -lunls11 -lsnls11 -lnls11 -lcore11 -lnls11  `cat /u01/app/oracle
INFO: /product/11.2./db_1/lib/sysliblist` INFO: /lib64/libstdc++.so.: undefined reference to `memcpy@GLIBC_2.'
collect2: error: ld returned exit status INFO: make: *** [ctxhx] Error INFO: End output from spawned process.
INFO: ----------------------------------
INFO: Exception thrown from action: make
Exception Name: MakefileException
Exception String: Error in invoking target 'install' of makefile '/u01/app/oracle/product/11.2.0/db_1/ctx/lib/ins_ctx.mk'. See '/u01/app/oraInventory/logs/installActions2015-04-17_10-00-15PM.log' for details.
Exception Severity:

Solution

Fix prior install

Execute the following script:

# Fix ctx/lib/ins_ctx.mk

ORACLE_SRC_INSTALL_DIR=/media/sf_uxora_share/database
cd ${ORACLE_SRC_INSTALL_DIR}/stage/Components jar_file=
for i_file in $( ls ./oracle.ctx/11.2.0.1.//DataFiles/filegroup*.jar ); do
unzip -l ${i_file} ctx/lib/ins_ctx.mk >& >/dev/null
[[ $? -eq ]] && jar_file=${i_file} && break
done cat << __EOF__ > /tmp/memcpy_wrap.c
#include <stddef.h>
#include <string.h> asm (".symver wrap_memcpy, memcpy@GLIBC_2.14");
void *wrap_memcpy(void *dest, const void *src, size_t n) {
return memcpy(dest, src, n);
}
__EOF__
unzip ${jar_file} ctx/lib/ins_ctx.mk >& >/dev/null
if [[ $? -eq ]]; then
sed -i -e 's/\$(INSO_LINK)/\$(INSO_LINK) -Wl,--wrap=memcpy_wrap \$(ORACLE_HOME)\/ctx\/lib\/memcpy_wrap.o/g' ctx/lib/ins_ctx.mk
gcc -c /tmp/memcpy_wrap.c -o ctx/lib/memcpy_wrap.o && rm /tmp/memcpy_wrap.c
jar -uvf ${jar_file} ctx/lib/ins_ctx.mk ctx/lib/memcpy_wrap.o
fi

Fix during install

This fix can only be done in GUI mode installer.
When the windows prompt this error message:

Error in invoking target 'install' of makefile '/u01/app/oracle/product/11.2.0/db_1/ctx/lib/ins_ctx.mk'. See '/u01/app/oraInventory/logs/installActions2015-04-17_10-00-15PM.log' for details.

Execute the following script then click retry to resume install

# Fix ctx/lib/ins_ctx.mk
ORACLE_HOME=/u01/app/oracle/product/11.2./db_1 cat << __EOF__ > /tmp/memcpy_wrap.c
#include <stddef.h>
#include <string.h> asm (".symver wrap_memcpy, memcpy@GLIBC_2.14");
void *wrap_memcpy(void *dest, const void *src, size_t n) {
return memcpy(dest, src, n);
}
__EOF__ if [[ -e "${ORACLE_HOME}/ctx/lib/ins_ctx.mk" ]]; then
sed -i -e 's/\$(INSO_LINK)/\$(INSO_LINK) -Wl,--wrap=memcpy_wrap \$(ORACLE_HOME)\/ctx\/lib\/memcpy_wrap.o/g' ${ORACLE_HOME}/ctx/lib/ins_ctx.mk
gcc -c /tmp/memcpy_wrap.c -o ${ORACLE_HOME}/ctx/lib/memcpy_wrap.o && rm /tmp/memcpy_wrap.c
fi
 
 

ins_emagent.mk error

Error output

INFO: ib/amd64 -z lazyload -ljava -ljvm -lverify -z nolazyload -Wl,-rpath,/u01/app/oracle/product/11.2./db_1/lib/:/u01/app/oracle/product/11.2./db_1/sysman/lib/:/u01/app/oracle/product/11.2./db_1/jdk/jre/lib/amd64/server:/u01/app/oracle/product/11.2./db_1/jdk/jre/lib/amd64 -Wl,--allow-shlib-undefined    `cat /u01/app/oracle/product/11.2./db_1/lib/sysliblist` -ldl -lm

INFO: /u01/app/oracle/product/11.2./db_1/sysman/lib/ins_emagent.mk:: warning: overriding recipe for target `nmosudo'
/u01/app/oracle/product/11.2./db_1/sysman/lib/ins_emagent.mk:: warning: ignoring old recipe for target `nmosudo' INFO: /usr/bin/ld: warning: -z lazyload ignored.
/usr/bin/ld: warning: -z nolazyload ignored.
/usr/bin/ld: /u01/app/oracle/product/11.2./db_1/sysman/lib//libnmectl.a(nmectlt.o): undefined reference to symbol 'B_DestroyKeyObject'
/usr/bin/ld: note: 'B_DestroyKeyObject' is defined in DSO /u01/app/oracle/product/11.2./db_1/lib/libnnz11.so so try adding it to the linker command line
/u01/app/oracle/product/11.2./db_1/lib/libnnz11.so: could not read symbols: Invalid operation
collect2: error: ld returned exit sta
INFO: tus INFO: make[]: Leaving directory `/u01/app/oracle/product/11.2./db_1/sysman/lib' INFO: make[]: *** [/u01/app/oracle/product/11.2./db_1/sysman/lib/emdctl] Error
make: *** [emdctl] Error INFO: End output from spawned process.
INFO: ----------------------------------
INFO: Exception thrown from action: make
Exception Name: MakefileException
Exception String: Error in invoking target 'agent nmhs' of makefile '/u01/app/oracle/product/11.2.0/db_1/sysman/lib/ins_emagent.mk'. See '/u01/app/oraInventory/logs/installActions2015-04-23_01-23-30PM.log' for details.
Exception Severity:

Solution

Fix prior install

Execute the following script:

# Fix sysman/lib/ins_emagent.mk

ORACLE_SRC_INSTALL_DIR=/media/sf_uxora_share/database
cd ${ORACLE_SRC_INSTALL_DIR}/stage/Components jar_file=
for i_file in $( ls ./oracle.sysman.agent/*/1/DataFiles/filegroup*.jar ); do
unzip -l ${i_file} sysman/lib/ins_emagent.mk 2>&1 1>/dev/null
[[ $? -eq 0 ]] && jar_file=${i_file} && break
done unzip ${jar_file} sysman/lib/ins_emagent.mk 2>&1 1>/dev/null
if [[ $? -eq 0 ]]; then
sed -i -e 's/\$(MK_EMAGENT_NMECTL)/\$(MK_EMAGENT_NMECTL) -lnnz11/g' sysman/lib/ins_emagent.mk
jar -uvf ${jar_file} sysman/lib/ins_emagent.mk
fi
Fix during install
This fix can only be done in GUI mode installer. When the windows prompt this error message: Error in invoking target 'agent nmhs' of makefile '/u01/app/oracle/product/11.2.0/db_1/sysman/lib/ins_emagent.mk'. See '/u01/app/oraInventory/logs/installActions2015-04-23_01-23-30PM.log' for details.
Execute the following script then click retry to resume install # Fix ctx/lib/ins_ctx.mk ORACLE_HOME=/u01/app/oracle/product/11.2.0/db_1 if [[ -e "${ORACLE_HOME}/sysman/lib/ins_emagent.mk" ]]; then
sed -i -e 's/\$(MK_EMAGENT_NMECTL)/\$(MK_EMAGENT_NMECTL) -lnnz11/g' ${ORACLE_HOME}/sysman/lib/ins_emagent.mk
fi

ORA-00845

Error output

ORA-: MEMORY_TARGET not supported on this system

Solution

Reduce memory target parameter

...

Increase the size of /dev/shm

# check filesystems
$ df -h
Filesystem Size Used Avail Use% Mounted on
/dev/mapper/ol-root 14G .0G .0G % /
devtmpfs .8G .8G % /dev
tmpfs .8G .9G .0G % /dev/shm
tmpfs .8G 8.9M .8G % /run
tmpfs .8G .8G % /sys/fs/cgroup
/dev/vdb1 32G 11G 22G % /u01
/dev/vda1 497M 150M 348M % /boot # increase /dev/shm accordingly to your max ram memory
$ mount -o remount,size=6G /dev/shm # make this change permanent, add/change /etc/fstab
$ vi /etc/fstab
...
tmpfs /dev/shm tmpfs defaults,size=6G
... # update mount
$ mount -a

ORA-19502/ORA-27072

Error output

...
ORA-: write error on file "...",
block number (block size=)
ORA-: File I/O error
Linux-x86_64 Error: : Inappropriate ioctl for device
...

Solution

Free disk space/Add disk space

There is not enough disk space. Check disk space with df -h <path>

ORA-28040: No matching authentication protocol

 

Error output

ORA-: No matching authentication protocol
ORA-: invalid username/password; logon denied

You may encounter this error with a new 12c database because Oracle Enterprise Cloud Manager 12c is still using the old 10g JDBC driver (ojdbc14.jar) to connect.

Prior to version 12c, the default setting for SQLNET.ALLOWED_LOGON_VERSION (deprecated parameter in 12c) was 8. Now in 12c the default value of the 12c equivalent parameters SQLNET.ALLOWED_LOGON_VERSION_CLIENT and SQLNET.ALLOWED_LOGON_VERSION_SERVER are now 11.

Solution/Workaround

# Set minimum logon authentification version in sqlnet.ora
# To avoid ORA-: No matching authentication protocol
[oracle]$ cat >> $ORACLE_HOME/network/admin/sqlnet.ora <<_EOF_
SQLNET.ALLOWED_LOGON_VERSION_SERVER=
SQLNET.ALLOWED_LOGON_VERSION_CLIENT=
_EOF_ # Recreate oracle user password to be compatible 10G
# To avoid ORA-: invalid username/password; logon denied
[oracle]$ sqlplus / as sysdba -- Check password compatibility
SQL> select USERNAME,PASSWORD_VERSIONS from dba_users where USERNAME = 'SYS';
USERNAME PASSWORD_VERSIONS
-------------------------------- -----------------
SYS 11G 12C -- Reinitialize password
SQL> alter user SYS identified by OraSys_pw0 ; User SYS altered. -- Check again password compatibility
SQL> select USERNAME,PASSWORD_VERSIONS from dba_users where USERNAME = 'SYS';
USERNAME PASSWORD_VERSIONS
-------------------------------- -----------------
SYS 10G 11G 12C

Now database instance will accept 10g authentification only with users who have 10G PASSWORD_VERSIONS compatibility.

the origin article can be found :https://www.uxora.com/oracle/dba/23-oracle-installation-errors-and-fixes

redhat 安装 oracle中途遇到的问题(1)的更多相关文章

  1. Redhat 安装Oracle DBI和DBD

    Redhat 安装DBI和ORACLE DBD tar -zxvf DBI-1.616.tar.gz cd DBI-1.616 perl Makefile.PL make make install 2 ...

  2. RedHat安装Oracle后中文乱码

    radhat7.1 Oracle11gr2 安装Oracle时忘记设置字符集,导致安装后中文乱码,中文变成"???????????" 分析原因是Oracle服务器端和客户端的字符集 ...

  3. Redhat安装Oracle 11g (转)

    1.1     安装前准备 1.1.1     修改操作系统核心参数 在Root用户下执行以下步骤: 1.1.1.1 修改/etc/security/limits.conf文件 输入命令:vi /et ...

  4. Oracle安装部署之RedHat安装Oracle11g_R2

    硬件配置 内存 :≥1G 硬盘空间:≥10G 上传oracle11g安装包: putty上用wcw用户登录,通过ftp服务上传oracle安装文件到/home/wcw目录下解压 #unzip linu ...

  5. Oracle安装部署之linux(redhat/centos)快速安装oracle 11g rac

    安装oracle 11gR2 RAC 一.网络规划及安装虚拟主机 主机名 主机版本 Ip rac1.localdomain Redhat 6.5 RAC节点1 192.168.100.11 rac2. ...

  6. 在RedHat 5下安装Oracle 10g详解(转)

    在RedHat 5下安装Oracle 10g详解(转) Posted on 2012-09-14 13:26 疯狂 阅读(5075) 评论(0)  编辑  收藏 所属分类: database .uni ...

  7. Redhat Linux 下安装Oracle 11g R2

    能够下载:http://download.csdn.net/detail/ykh554541184/8086647文档方便查阅 官方文档:http://docs.oracle.com/cd/E1188 ...

  8. Redhat 6环境下安装Oracle 12c的方法

    Step 1: 要在Linux上安装Oracle,需要在安装Oracle之前安装好相应的软件包,在不同操作系统环境下,对软件包的要求各不相同.具体对应的软件包,见官网文档:https://docs.o ...

  9. Redhat 6.2安装Oracle 11gclient及遇到的问题分析

    昨天在Redhat6.2(64 bit)上安装oracle 11.2.0.1.0 client(32 bit),下面是安装中碰到的一些问题及处理过程记录 首先解压缩安装包,会生成一个client文件夹 ...

随机推荐

  1. How to: Change the Format Used for the FullAddress and FullName Properties 如何:更改用于FullAddress和FullName属性的格式

    There are FullAddress and FullName properties in the Address and Person business classes that are su ...

  2. spring cloud学习与思考——总起篇

    接下来就spring cloud( Spring Boot 2.0版本)写一个系列,一方面加深记忆理解,做个日志,另一个方面,借这个方式跟朋友们沟通交流. 1.Spring boot是Spring的一 ...

  3. jsp + js + 前端弹出框

    在项目中,前端页面我们时常需要各种各样的弹出框: 1.alert对话框:显示含有给定消息的"JavaScript Alert"对话框 代码: var a = "Hello ...

  4. A Code Farmer‘s Entertainment

    My guitar playing and singing 码农的自娱自乐 https://v.youku.com/v_show/id_XNDM4NTY1MTEwNA==.html?spm=a2hzp ...

  5. 解决idea中mysql连接失败Could not create connection to database server. Attempted reconnect 3 times. Giving up.

    原因是少一个参数,设置时区的.  解决方法: 加一个参数: serverTimezone=UTC jdbc:mysql://localhost:3306/SshProject?useUnicode=t ...

  6. Mac中创建一个OpenGL项目

    配置: OS X10.10 + Xcode 6.0 一.基本步骤 新建一个命令窗口项目 更改目标设备版本号为 OS X 8.0 添加库文件 GLUT.framework 和 OpenGL.framew ...

  7. pytest系列(一):什么是单元测试界的高富帅?

    pytest是python语言中一款强大的单元测试框架,用来管理和组织测试用例,可应用在单元测试.自动化测试工作中. unittest也是python语言中一款单元测试框架,但是功能有限,没有pyte ...

  8. [C]#include和链接

    概述 对于刚接触C语言的同学来说,通常对“在文件中用#include预处理操作符引入文件”和“编译时链接多个文件”这两个操作会有所混淆,这个文章主要为了解析一下它们的区别. #include预处理操作 ...

  9. 08. Go 语言包(package)

    Go 语言包(package) Go 语言的源码复用建立在包(package)基础之上.Go 语言的入口 main() 函数所在的包(package)叫 main,main 包想要引用别的代码,必须同 ...

  10. 关于定义序列化器时,read_only和write_only有什么作用

    关于序列化和反序列化 ​ 在谈论前,先说一下序列化和反序列化,这两个概念最初是在学习json的时候提出来的,回头来看,其实可以用最初的理解就可以了 序列化就是将对象转化方便传输和存储字节序列,例如js ...