SSE优化指令集编译错误: inlining failed in call to always_inline 'xxx': target specific option mismatch xxx
在用QtCreator编译SSE优化指令的时候,出现了如下错误,
inlining failed in call to always_inline '__m128i _mm_packus_epi32(__m128i, __m128i)': target specific option mismatch
_mm_packus_epi32 (__m128i __X, __m128i __Y)
^
该错误的原因是编译的时候没有指定对应的SSE选项。
解决办法:在文档中找到出错指令对应的SSE指令集,Intel官方指令集向导,然后添加到QT工程设置中,如上述出错的指令packusdw是在
sse4.1中,所以在QT设置中添加:
QMAKE_CXXFLAGS += "-msse4.1"
类似的还有,
QMAKE_CXXFLAGS += "-msse2"
QMAKE_CXXFLAGS += "-mssse3"
……
如果是自己写makefile,设置办法类似,也是添加-msse2,-msse4.1等选项。
SSE优化指令集编译错误: inlining failed in call to always_inline 'xxx': target specific option mismatch xxx的更多相关文章
- 编译内核时报错./include/net/sch_generic.h:535:28: error: inlining failed in call to always_inline 'qdisc_pkt_len': indirect function call with a yet undetermined callee static inline unsigned int qdisc_pkt_
直接修改头文件include/net/sch_generic.h中的qdisc_pkt_len函数 将static inline unsigned int qdisc_pkt_len修改为: stat ...
- TensorFlow CPU环境 SSE/AVX/FMA 指令集编译
TensorFlow CPU环境 SSE/AVX/FMA 指令集编译 sess.run()出现如下Warning W tensorflow/core/platform/cpu_feature_guar ...
- 我看见的第一个XCODE编译错误 - Command /applications.../clang failed with exit code 1
开始用XCODE学习Apple相关开发的东东,写些demo熟悉Object C,一直还没看见什么问题,昨晚在家把一些demo上传到代码服务器,今天在另外一台机器上下载下来编译,出现了问题: Preco ...
- xamarin.forms新建项目android编译错误
vs2015 update3 新建的xamarin.forms项目中的android项目编译错误.提示缺少android_m2repository_r22.zip,96659D653BDE0FAEDB ...
- assets中放入中文文件名导致Android Studio编译错误
一个android项目突然出现编译错误,如下: :app:processDebugResources FAILED FAILURE: Build failed with an exception. * ...
- 自然饱和度(Vibrance)算法的模拟实现及其SSE优化(附源码,可作为SSE图像入门,Vibrance算法也可用于简单的肤色调整)。
Vibrance这个单词搜索翻译一般振动,抖动或者是响亮.活力,但是官方的词汇里还从来未出现过自然饱和度这个词,也不知道当时的Adobe中文翻译人员怎么会这样处理.但是我们看看PS对这个功能的解释: ...
- SSE图像算法优化系列八:自然饱和度(Vibrance)算法的模拟实现及其SSE优化(附源码,可作为SSE图像入门,Vibrance算法也可用于简单的肤色调整)。
Vibrance这个单词搜索翻译一般振动,抖动或者是响亮.活力,但是官方的词汇里还从来未出现过自然饱和度这个词,也不知道当时的Adobe中文翻译人员怎么会这样处理.但是我们看看PS对这个功能的解释: ...
- ubuntu 客户机安装VMware tools时出现编译错误,无法与主机共享文件(转)
主机:win7旗舰版 vmware workstation 10.0.7 (其他10.x版本也有这个问题) 客户机:Ubuntu14.04.4-16.x 安装vmware tools时出现下列编译错误 ...
- Android Studio中关于9-patch格式图片的编译错误
最近在编译Android Studio开发的项目中在使用了9宫图后出现了编译错误,尝试了多种方法未能解决,最后仔细查看出错的日志发现,居然是图片的原因,图片中包含有alpah通道所以在执行app:me ...
随机推荐
- Java 学习 day05
01-面向对象(概述) 面向对象 -- 冰箱.打开:冰箱.存储:冰箱.关闭: 02-面向对象(举例) 使用和指挥 -- 对象,不需要关注过程,只关注结果: 一切皆对象,万物皆对象 -- 自<T ...
- vscode webstrom 配置 eslint 使用 airbnb 规范
1.安装eslint npm eslint-plugin-react eslint-plugin-import babel-eslint -g 2.全局配置文件,放到c:/user/***/ { &q ...
- Asp.Net中判断是否登录,及是否有权限?
不需要在每个页面都做判段, 方法一:只需要做以下处理即可 using System; using System.Collections.Generic; using System.Linq; usin ...
- 淘宝(新浪)API获取IP地址位置信息
package com.parse; import java.io.BufferedReader; import java.io.DataOutputStream; import java.io.IO ...
- 扩容数据盘_Linux
扩容数据盘_Linux_扩容云盘_云盘_用户指南_云服务器 ECS-阿里云 https://help.aliyun.com/document_detail/25452.html 磁盘扩容付费后: 在控 ...
- 【题解】数字组合(NTT+组合 滑稽)
[题解]数字组合(NTT+组合 滑稽) 今天实践一下谢总讲的宰牛刀233,滑稽. \((1+x)(1+x)(1+x)\)的\(x^2\)系数就代表了有三个一快钱硬币构成的两块钱的方案数量. 很好理解, ...
- 【css学习整理】浮动,清除
css内边距属性: padding padding-top right bottom left 如果是两个数字,指的是上下,左右 padding: 10px 20px 上下10 左右20 如果是三 ...
- 一次php脚本出现段错误(Segment fault)的经历
今天在一台新服务器上cli运行一个php脚本,出现了Segment fault错误,第一感觉应该是某个扩展安装有问题 这段php代码是调用soap接口,查看soap扩展没啥问题,一时不知道是啥原因. ...
- 分布式锁的实现方式——ACID数据库、缓存或者是zk
针对分布式锁的实现,目前比较常用的有以下几种方案: 基于数据库实现分布式锁 基于缓存(redis,memcached,tair)实现分布式锁 基于Zookeeper实现分布式锁 在分析这几种实现方案之 ...
- JavaScript里值比较的方法
JavaScript里值比较的方法 参考资料 一张图彻底搞懂JavaScript的==运算 toString()和valueof()方法的区别 Object.is 和 == 与 === 不同 == 运 ...