Preface
When I was compiling the sysbench just now,I encountered some failures in the precedure.I'll show the issue and workaround below.
Issues
1. Executing autogen.sh script turned out to be error.
[root@docker1 sysbench]# ./autogen.sh
-bash: ./autogen.sh: /bin/sh^M: bad interpreter: No such file or directory
[root@docker1 sysbench]# cat autogen.sh
#!/bin/sh
autoreconf -vi
Even I directly run "autoreconf -vi" command,it still showed error
[root@docker1 sysbench]# autoreconf -vi
autoreconf: Entering directory `.'
autoreconf: configure.ac: not using Gettext
autoreconf: running: aclocal -I m4
autoreconf: configure.ac: tracing
autoreconf: running: libtoolize --copy
.ibtoolize: AC_CONFIG_MACRO_DIR([m4]) conflicts with ACLOCAL_AMFLAGS=-I m4
autoreconf: libtoolize failed with exit status: 1
Then,I found a workaround:
Because I've used "git clone" to download the source package of sysbench directly without disabling the transcoding first.
After that,the shell could be executed,but when I continue to execute configure and make,there were still some errors found.
2. Executing make turned out to be error.
[root@docker1 sysbench]# ./configure --with-mysql-includes=/usr/local/mysql/include --with-mysql-libs=/usr/local/mysql/lib && make && make install
...
In file included from lj_ffrecord.c:1197:0:
lj_recdef.h:225:1: error: ?.ecff_rawlen?.undeclared here (not in a function)
recff_rawlen,
^
make[3]: *** [lj_ffrecord.o] Error 1
make[3]: Leaving directory `/opt/mysql/sysbench/third_party/luajit/tmp/luajit/src'
make[2]: *** [src/luajit] Error 2
make[2]: Leaving directory `/opt/mysql/sysbench/third_party/luajit/tmp/luajit'
make[1]: *** [lib/libluajit-5.1.a] Error 2
make[1]: Leaving directory `/opt/mysql/sysbench/third_party/luajit'
make: *** [all-recursive] Error 1
[root@docker1 luajit]# pwd
/opt/mysql/sysbench/third_party/luajit
[root@docker1 luajit]# find . -type f -print0 | xargs -0 dos2unix
Then,the LuaJIT issue was okay.
==== Successfully installed LuaJIT 2.1.0-beta3 to /opt/mysql/sysbench/third_party/luajit ====
Note: the development releases deliberately do NOT install a symlink for luajit
You can do this now by running this command (with sudo):
ln -sf luajit-2.1.0-beta3 /opt/mysql/sysbench/third_party/luajit/bin/luajit
make[2]: warning: Clock skew detected. Your build may be incomplete.
make[2]: Leaving directory `/opt/mysql/sysbench/third_party/luajit/tmp/luajit'
make[1]: warning: Clock skew detected. Your build may be incomplete.
make[1]: Leaving directory `/opt/mysql/sysbench/third_party/luajit'
Making all in third_party/concurrency_kit
make[1]: Entering directory `/opt/mysql/sysbench/third_party/concurrency_kit'
make[1]: Warning: File `Makefile' has modification time 143 s in the future
rm -rf tmp
mkdir tmp
tar -C . -cf - ck | tar -xf - -C tmp/
chmod -R u+w tmp
cd tmp/ck && \
CC="gcc -std=gnu99" \
CFLAGS="-O3 -funroll-loops -ggdb3 -march=core2 -D_GNU_SOURCE " \
LDFLAGS="-L/usr/local/lib" \
./configure \
--prefix=/opt/mysql/sysbench/third_party/concurrency_kit && \
make && \
make install
/bin/sh: ./configure: /bin/sh^M: bad interpreter: No such file or directory
make[1]: *** [lib/libck.a] Error 126
make[1]: Leaving directory `/opt/mysql/sysbench/third_party/concurrency_kit'
make: *** [all-recursive] Error 1
Then,I used dos2unix to transcode all the files in "/opt/mysql/sysbench/third_party" and it began to go on.But I was not be happy for long.Errors appeared one by one,faint!
lua/internal/sysbench.histogram.lua.h:137:3: warning: missing terminating " character [enabled by default]
lua/internal/sysbench.histogram.lua.h:137:1: error: missing terminating " character
make[2]: *** [sb_lua.o] Error 1
make[2]: Leaving directory `/opt/mysql/sysbench/src'
make[1]: *** [all-recursive] Error 1
make[1]: Leaving directory `/opt/mysql/sysbench/src'
make: *** [all-recursive] Error 1
This time I decided to transcode the whole files in "/opt/mysql/sysbench/src",but it turned out to be useless.Okay,then I gave up for continuing seeking the way to find it out.I downloaded the sysbench package again and disable transcoding automatically method by executing command below:
git config --global core.autocrlf false
git config --global core.safecrlf true
git config --global core.eol lf
Another make error shew up.
Making all in lua
make[2]: Entering directory `/opt/mysql/sysbench/src/lua'
make[2]: Warning: File `Makefile' has modification time 479 s in the future
Making all in internal
make[3]: Entering directory `/opt/mysql/sysbench/src/lua/internal'
make[3]: Warning: File `Makefile' has modification time 479 s in the future
make all-am
make[4]: Entering directory `/opt/mysql/sysbench/src/lua/internal'
make[4]: Warning: File `Makefile' has modification time 478 s in the future
make[4]: Nothing to be done for `all-am'.
make[4]: warning: Clock skew detected. Your build may be incomplete.
make[4]: Leaving directory `/opt/mysql/sysbench/src/lua/internal'
make[3]: warning: Clock skew detected. Your build may be incomplete.
make[3]: Leaving directory `/opt/mysql/sysbench/src/lua/internal'
make[3]: Entering directory `/opt/mysql/sysbench/src/lua'
make[3]: Warning: File `Makefile' has modification time 478 s in the future
make[3]: Nothing to be done for `all-am'.
make[3]: warning: Clock skew detected. Your build may be incomplete.
make[3]: Leaving directory `/opt/mysql/sysbench/src/lua'
make[2]: warning: Clock skew detected. Your build may be incomplete.
make[2]: Leaving directory `/opt/mysql/sysbench/src/lua'
Making all in .
make[2]: Entering directory `/opt/mysql/sysbench/src'
make[2]: Warning: File `.deps/sysbench.Po' has modification time 536 s in the future
make[2]: Nothing to be done for `all-am'.
make[2]: warning: Clock skew detected. Your build may be incomplete.
make[2]: Leaving directory `/opt/mysql/sysbench/src'
make[1]: warning: Clock skew detected. Your build may be incomplete.
make[1]: Leaving directory `/opt/mysql/sysbench/src'
Making all in tests
make[1]: Entering directory `/opt/mysql/sysbench/tests'
make[1]: Warning: File `Makefile' has modification time 478 s in the future
make[1]: Nothing to be done for `all'.
make[1]: warning: Clock skew detected. Your build may be incomplete.
make[1]: Leaving directory `/opt/mysql/sysbench/tests'
make[1]: Entering directory `/opt/mysql/sysbench'
make[1]: Warning: File `Makefile' has modification time 478 s in the future
make[1]: Nothing to be done for `all-am'.
make[1]: warning: Clock skew detected. Your build may be incomplete.
make[1]: Leaving directory `/opt/mysql/sysbench'
make: warning: Clock skew detected. Your build may be incomplete.
There's a solution here:
But I waited for the count down over and then make it again.It was done successfully in the end.
[root@docker1 third_party]# sysbench -v
sysbench 1.1.0-431660d (using bundled LuaJIT 2.1.0-beta3)
- 编译安装PHP 时遇到问题解决方法.
编译安装PHP时出现下面的错误代码: error 2 checking for pkg-config... /usr/bin/pkg-config configure: error: Cannot f ...
- 编译安装php时遇到virtual memory exhausted: Cannot allocate memory
有时候用vps建站时需要通过编译的方式来安装主机控制面板.对于大内存的VPS来说一般问题不大,但是对于小内存,比如512MB内存的godaddy VPS来说,很有可能会出现问题,因为编译过程是一个内存 ...
- 编译安装nginx时配置开机自启
详细编译安装nginx请参考[Nginx目录结构与配置文件详解]以及[Nginx安装部署],在这里就进行简单安装 安装Nginx 环境介绍 操作系统: [root@localhost ~]# cat ...
- 编译安装 zbar 时两次 make 带来的惊喜
为了装 php 的条形码扩展模块 php-zbarcode,先装了一天的 ImageMagick 和 zbar.也许和我装的 Ubuntu 17.10 的有版本兼容问题吧,总之什么毛病都有,apt 不 ...
- 编译安装php时提示Cannot find MySQL header files的解决方法
php的配置文件中有一行--with-mysql=/usr/local/mysql ,安装的时候提示:configure: error: Cannot find MySQL header files ...
- 【转】解决编译安装NGINX时make报错
编译参数:--[root@localhostnginx-1.4.6]#./configure--user=nginx--group=nginx--prefix=/usr/local/nginx--wi ...
- git bash的安装与配置
作业要求来自于:https://edu.cnblogs.com/campus/gzcc/GZCC-16SE2/homework/2097 1.下载安装配置用户名和邮箱. (1)下载安装Github配置 ...
- CentOS 7编译安装gcc5.3碰到的坑
下载最新的iso安装完毕后,发现gcc还是4.8版本的,就考虑升级到5.x 参考这个帖子 基本也没啥,但是执行download_prerequisites 时简直坑爹,三个压缩包都不超过2M 反复尝试 ...
- 安装Pomelo 时遇到的坑
一.Pomelo相关的代码地址 https://github.com/NetEase,这里面包含比较多的项目. 2. https://github.com/NetEase/pomelo/wiki/%E ...
随机推荐
- import(导入)过期的磁带 -----先留个引子,后期更改补充
在某些情况下,客户需要恢复已经过期的磁带上的数据, 如果磁带没有被重新使用,数据没有被覆盖掉,可以使用 netbackup 的 import 方法将过期的磁带上的数据 import 到 netback ...
- springmvc小结(下)
1.@ModelAttribute 1.给共享的数据设置model数据设置,贴在形参上,也可以贴在方法上,设置一个model的key值 2.当controller方法返回一个对象的时候,,缺省值会把当 ...
- ResourceWarning: unclosed <socket.socket fd=864, family=AddressFamily.AF_INET, type=SocketKind.SOCK_STREAM, proto=0, laddr=('10.100.x.x', 37321), raddr=('10.1.x.x', 8500)>解决办法
将代码封装,并使用unittest调用时,返回如下警告: C:\python3.6\lib\collections\__init__.py:431: ResourceWarning: unclosed ...
- 关于接口返回BOM头处理的问题
今天用RestClient框架做接口请求.结果请求回来的json转模型失败.提示JSON格式不正确.到BeJson网站验证一下,发现果然不对. 后来得知是由于json信息带着bom头导致的,这个该死的 ...
- 二十三、详述 IntelliJ IDEA 中恢复代码的方法「进阶篇」
咱们已经了解了如何将代码恢复至某一版本,但是通过Local History恢复代码有的时候并不方便,例如咱们将项目中的代码进行了多处修改,这时通过Local History恢复代码就显得很麻烦,因为它 ...
- 下载安装Redis+使用
Window 下安装 第一步:安装 下载地址:https://github.com/MSOpenTech/redis/releases 第二步:解压(盘符) 第三步:打开一个 cmd 窗口 使用 cd ...
- Android 第三方应用接入微信平台研究情况分享
微信平台开放后倒是挺火的,许多第三方应用都想试下接入微信这个平台,毕竟可以利用微信建立起来的关系链来拓展自己的应用还是挺不错的 最近由于实习需要也在研究这个东西,这里把我的整个研究情况给出来 微信平台 ...
- synchronized 控制并发(活动秒杀)
1.首先我们新建一个Controller用于秒杀: package com.imooc.Controller; import com.imooc.service.impl.SeckillService ...
- 环境配置之 Debug 和 Release - iOS
便于开发.打包中在不同环境(测试.生产)间属性的切换更加方便便捷流畅,故创建设置此方式方法,希望对大家能有所帮助. 首先,创建 Configurations Setting File(.xcconfi ...
- NodeJ node.js Jquery Ajax 跨域请求
Jquery + Ajax 跨域请求 说白了就是前台请求ajax数据(JSON)但是请求的数据不在本地的绝对路径下,接口数据 是没有这个安全性的我对外公开的接口数据,只要你找到接口你就可以使用里面的数 ...