新建一个java文件,含有main方法

package com.why.project.androidcnblogsdemo.utils;

/**
* Created by HaiyuKing
* Used
*/ public class RunMain { public static void main(String[] args) {
String result = "Run Main";
System.out.println(result);
}
}

点击选中类文件——鼠标右键——Run 'xxx.main()'

Android Studio进行编译

有时候可能会报错

Error:Gradle:
FAILURE: Build failed with an exception. * What went wrong:
Execution failed for task ':app:processDebugResources'.
> Failed to process resources, see aapt output above for details. * Try:
Run with --stacktrace option to get the stack trace. Run with --info or --debug option to get more log output. Run with --scan to get full insights. * Get more help at https://help.gradle.org BUILD FAILED in 3s

如何查看更多日志信息

在File->setting->Build,Execution,Deployment->Compiler 的Options配置(--debug --stacktrace),打印日志信息。

Error:Gradle: 11:23:31.485 [ERROR] [org.gradle.internal.buildevents.BuildExceptionReporter]
11:23:31.485 [ERROR] [org.gradle.internal.buildevents.BuildExceptionReporter] FAILURE: Build failed with an exception.
11:23:31.485 [ERROR] [org.gradle.internal.buildevents.BuildExceptionReporter]
11:23:31.485 [ERROR] [org.gradle.internal.buildevents.BuildExceptionReporter] * What went wrong:
11:23:31.485 [ERROR] [org.gradle.internal.buildevents.BuildExceptionReporter] Execution failed for task ':app:processDebugResources'.
11:23:31.486 [ERROR] [org.gradle.internal.buildevents.BuildExceptionReporter] > Failed to process resources, see aapt output above for details.
11:23:31.486 [ERROR] [org.gradle.internal.buildevents.BuildExceptionReporter]
11:23:31.486 [ERROR] [org.gradle.internal.buildevents.BuildExceptionReporter] * Try:
11:23:31.486 [ERROR] [org.gradle.internal.buildevents.BuildExceptionReporter] Run with --scan to get full insights.
11:23:31.486 [ERROR] [org.gradle.internal.buildevents.BuildExceptionReporter]
11:23:31.486 [ERROR] [org.gradle.internal.buildevents.BuildExceptionReporter] * Exception is:
11:23:31.487 [ERROR] [org.gradle.internal.buildevents.BuildExceptionReporter] org.gradle.api.tasks.TaskExecutionException: Execution failed for task ':app:processDebugResources'.
11:23:31.487 [ERROR] [org.gradle.internal.buildevents.BuildExceptionReporter] at org.gradle.api.internal.tasks.execution.ExecuteActionsTaskExecuter.executeActions(ExecuteActionsTaskExecuter.java:100)
11:23:31.487 [ERROR] [org.gradle.internal.buildevents.BuildExceptionReporter] at org.gradle.api.internal.tasks.execution.ExecuteActionsTaskExecuter.execute(ExecuteActionsTaskExecuter.java:70)
11:23:31.487 [ERROR] [org.gradle.internal.buildevents.BuildExceptionReporter] at org.gradle.api.internal.tasks.execution.OutputDirectoryCreatingTaskExecuter.execute(OutputDirectoryCreatingTaskExecuter.java:51)
11:23:31.487 [ERROR] [org.gradle.internal.buildevents.BuildExceptionReporter] at org.gradle.api.internal.tasks.execution.SkipUpToDateTaskExecuter.execute(SkipUpToDateTaskExecuter.java:62)
11:23:31.487 [ERROR] [org.gradle.internal.buildevents.BuildExceptionReporter] at org.gradle.api.internal.tasks.execution.ResolveTaskOutputCachingStateExecuter.execute(ResolveTaskOutputCachingStateExecuter.java:54)
11:23:31.487 [ERROR] [org.gradle.internal.buildevents.BuildExceptionReporter] at org.gradle.api.internal.tasks.execution.ValidatingTaskExecuter.execute(ValidatingTaskExecuter.java:60)
11:23:31.487 [ERROR] [org.gradle.internal.buildevents.BuildExceptionReporter] at org.gradle.api.internal.tasks.execution.SkipEmptySourceFilesTaskExecuter.execute(SkipEmptySourceFilesTaskExecuter.java:97)
11:23:31.488 [ERROR] [org.gradle.internal.buildevents.BuildExceptionReporter] at org.gradle.api.internal.tasks.execution.CleanupStaleOutputsExecuter.execute(CleanupStaleOutputsExecuter.java:87)
11:23:31.488 [ERROR] [org.gradle.internal.buildevents.BuildExceptionReporter] at org.gradle.api.internal.tasks.execution.ResolveTaskArtifactStateTaskExecuter.execute(ResolveTaskArtifactStateTaskExecuter.java:52)
11:23:31.488 [ERROR] [org.gradle.internal.buildevents.BuildExceptionReporter] at org.gradle.api.internal.tasks.execution.SkipTaskWithNoActionsExecuter.execute(SkipTaskWithNoActionsExecuter.java:52)
11:23:31.488 [ERROR] [org.gradle.internal.buildevents.BuildExceptionReporter] at org.gradle.api.internal.tasks.execution.SkipOnlyIfTaskExecuter.execute(SkipOnlyIfTaskExecuter.java:54)
11:23:31.488 [ERROR] [org.gradle.internal.buildevents.BuildExceptionReporter] at org.gradle.api.internal.tasks.execution.ExecuteAtMostOnceTaskExecuter.execute(ExecuteAtMostOnceTaskExecuter.java:43)
11:23:31.488 [ERROR] [org.gradle.internal.buildevents.BuildExceptionReporter] at org.gradle.api.internal.tasks.execution.CatchExceptionTaskExecuter.execute(CatchExceptionTaskExecuter.java:34)
11:23:31.488 [ERROR] [org.gradle.internal.buildevents.BuildExceptionReporter] at org.gradle.execution.taskgraph.DefaultTaskGraphExecuter$EventFiringTaskWorker$1.run(DefaultTaskGraphExecuter.java:248)
11:23:31.488 [ERROR] [org.gradle.internal.buildevents.BuildExceptionReporter] at org.gradle.internal.progress.DefaultBuildOperationExecutor$RunnableBuildOperationWorker.execute(DefaultBuildOperationExecutor.java:336)
11:23:31.488 [ERROR] [org.gradle.internal.buildevents.BuildExceptionReporter] at org.gradle.internal.progress.DefaultBuildOperationExecutor$RunnableBuildOperationWorker.execute(DefaultBuildOperationExecutor.java:328)
11:23:31.489 [ERROR] [org.gradle.internal.buildevents.BuildExceptionReporter] at org.gradle.internal.progress.DefaultBuildOperationExecutor.execute(DefaultBuildOperationExecutor.java:199)
11:23:31.489 [ERROR] [org.gradle.internal.buildevents.BuildExceptionReporter] at org.gradle.internal.progress.DefaultBuildOperationExecutor.run(DefaultBuildOperationExecutor.java:110)
11:23:31.489 [ERROR] [org.gradle.internal.buildevents.BuildExceptionReporter] at org.gradle.execution.taskgraph.DefaultTaskGraphExecuter$EventFiringTaskWorker.execute(DefaultTaskGraphExecuter.java:241)
11:23:31.489 [ERROR] [org.gradle.internal.buildevents.BuildExceptionReporter] at org.gradle.execution.taskgraph.DefaultTaskGraphExecuter$EventFiringTaskWorker.execute(DefaultTaskGraphExecuter.java:230)
11:23:31.489 [ERROR] [org.gradle.internal.buildevents.BuildExceptionReporter] at org.gradle.execution.taskgraph.DefaultTaskPlanExecutor$TaskExecutorWorker.processTask(DefaultTaskPlanExecutor.java:123)
11:23:31.490 [ERROR] [org.gradle.internal.buildevents.BuildExceptionReporter] at org.gradle.execution.taskgraph.DefaultTaskPlanExecutor$TaskExecutorWorker.access$200(DefaultTaskPlanExecutor.java:79)
11:23:31.490 [ERROR] [org.gradle.internal.buildevents.BuildExceptionReporter] at org.gradle.execution.taskgraph.DefaultTaskPlanExecutor$TaskExecutorWorker$1.execute(DefaultTaskPlanExecutor.java:104)
11:23:31.490 [ERROR] [org.gradle.internal.buildevents.BuildExceptionReporter] at org.gradle.execution.taskgraph.DefaultTaskPlanExecutor$TaskExecutorWorker$1.execute(DefaultTaskPlanExecutor.java:98)
11:23:31.490 [ERROR] [org.gradle.internal.buildevents.BuildExceptionReporter] at org.gradle.execution.taskgraph.DefaultTaskExecutionPlan.execute(DefaultTaskExecutionPlan.java:626)
11:23:31.492 [ERROR] [org.gradle.internal.buildevents.BuildExceptionReporter] at org.gradle.execution.taskgraph.DefaultTaskExecutionPlan.executeWithTask(DefaultTaskExecutionPlan.java:581)
11:23:31.492 [ERROR] [org.gradle.internal.buildevents.BuildExceptionReporter] at org.gradle.execution.taskgraph.DefaultTaskPlanExecutor$TaskExecutorWorker.run(DefaultTaskPlanExecutor.java:98)
11:23:31.492 [ERROR] [org.gradle.internal.buildevents.BuildExceptionReporter] at org.gradle.internal.concurrent.ExecutorPolicy$CatchAndRecordFailures.onExecute(ExecutorPolicy.java:63)
11:23:31.492 [ERROR] [org.gradle.internal.buildevents.BuildExceptionReporter] at org.gradle.internal.concurrent.ManagedExecutorImpl$1.run(ManagedExecutorImpl.java:46)
11:23:31.493 [ERROR] [org.gradle.internal.buildevents.BuildExceptionReporter] at org.gradle.internal.concurrent.ThreadFactoryImpl$ManagedThreadRunnable.run(ThreadFactoryImpl.java:55)
11:23:31.493 [ERROR] [org.gradle.internal.buildevents.BuildExceptionReporter] Caused by: org.gradle.tooling.BuildException: Failed to process resources, see aapt output above for details.
11:23:31.493 [ERROR] [org.gradle.internal.buildevents.BuildExceptionReporter] at com.android.build.gradle.internal.res.LinkApplicationAndroidResourcesTask.invokeAaptForSplit(LinkApplicationAndroidResourcesTask.java:512)
11:23:31.493 [ERROR] [org.gradle.internal.buildevents.BuildExceptionReporter] at com.android.build.gradle.internal.res.LinkApplicationAndroidResourcesTask.doFullTaskAction(LinkApplicationAndroidResourcesTask.java:249)
11:23:31.493 [ERROR] [org.gradle.internal.buildevents.BuildExceptionReporter] at com.android.build.gradle.internal.tasks.IncrementalTask.taskAction(IncrementalTask.java:106)
11:23:31.493 [ERROR] [org.gradle.internal.buildevents.BuildExceptionReporter] at org.gradle.internal.reflect.JavaMethod.invoke(JavaMethod.java:73)
11:23:31.493 [ERROR] [org.gradle.internal.buildevents.BuildExceptionReporter] at org.gradle.api.internal.project.taskfactory.IncrementalTaskAction.doExecute(IncrementalTaskAction.java:46)
11:23:31.493 [ERROR] [org.gradle.internal.buildevents.BuildExceptionReporter] at org.gradle.api.internal.project.taskfactory.StandardTaskAction.execute(StandardTaskAction.java:39)
11:23:31.493 [ERROR] [org.gradle.internal.buildevents.BuildExceptionReporter] at org.gradle.api.internal.project.taskfactory.StandardTaskAction.execute(StandardTaskAction.java:26)
11:23:31.493 [ERROR] [org.gradle.internal.buildevents.BuildExceptionReporter] at org.gradle.api.internal.tasks.execution.ExecuteActionsTaskExecuter$1.run(ExecuteActionsTaskExecuter.java:121)
11:23:31.493 [ERROR] [org.gradle.internal.buildevents.BuildExceptionReporter] at org.gradle.internal.progress.DefaultBuildOperationExecutor$RunnableBuildOperationWorker.execute(DefaultBuildOperationExecutor.java:336)
11:23:31.493 [ERROR] [org.gradle.internal.buildevents.BuildExceptionReporter] at org.gradle.internal.progress.DefaultBuildOperationExecutor$RunnableBuildOperationWorker.execute(DefaultBuildOperationExecutor.java:328)
11:23:31.493 [ERROR] [org.gradle.internal.buildevents.BuildExceptionReporter] at org.gradle.internal.progress.DefaultBuildOperationExecutor.execute(DefaultBuildOperationExecutor.java:199)
11:23:31.493 [ERROR] [org.gradle.internal.buildevents.BuildExceptionReporter] at org.gradle.internal.progress.DefaultBuildOperationExecutor.run(DefaultBuildOperationExecutor.java:110)
11:23:31.494 [ERROR] [org.gradle.internal.buildevents.BuildExceptionReporter] at org.gradle.api.internal.tasks.execution.ExecuteActionsTaskExecuter.executeAction(ExecuteActionsTaskExecuter.java:110)
11:23:31.494 [ERROR] [org.gradle.internal.buildevents.BuildExceptionReporter] at org.gradle.api.internal.tasks.execution.ExecuteActionsTaskExecuter.executeActions(ExecuteActionsTaskExecuter.java:92)
11:23:31.494 [ERROR] [org.gradle.internal.buildevents.BuildExceptionReporter] ... 29 more
11:23:31.494 [ERROR] [org.gradle.internal.buildevents.BuildExceptionReporter] Suppressed: java.lang.RuntimeException: Some file processing failed, see logs for details
11:23:31.494 [ERROR] [org.gradle.internal.buildevents.BuildExceptionReporter] at com.android.builder.internal.aapt.QueuedResourceProcessor.waitForAll(QueuedResourceProcessor.java:121)
11:23:31.494 [ERROR] [org.gradle.internal.buildevents.BuildExceptionReporter] at com.android.builder.internal.aapt.QueuedResourceProcessor.end(QueuedResourceProcessor.java:141)
11:23:31.494 [ERROR] [org.gradle.internal.buildevents.BuildExceptionReporter] at com.android.builder.internal.aapt.v2.QueueableAapt2.close(QueueableAapt2.java:104)
11:23:31.494 [ERROR] [org.gradle.internal.buildevents.BuildExceptionReporter] at com.android.build.gradle.internal.res.LinkApplicationAndroidResourcesTask.doFullTaskAction(LinkApplicationAndroidResourcesTask.java:293)
11:23:31.494 [ERROR] [org.gradle.internal.buildevents.BuildExceptionReporter] at com.android.build.gradle.internal.tasks.IncrementalTask.taskAction(IncrementalTask.java:106)
11:23:31.494 [ERROR] [org.gradle.internal.buildevents.BuildExceptionReporter] at sun.reflect.GeneratedMethodAccessor120.invoke(Unknown Source)
11:23:31.494 [ERROR] [org.gradle.internal.buildevents.BuildExceptionReporter] at sun.reflect.DelegatingMethodAccessorImpl.invoke(DelegatingMethodAccessorImpl.java:43)
11:23:31.494 [ERROR] [org.gradle.internal.buildevents.BuildExceptionReporter] at java.lang.reflect.Method.invoke(Method.java:498)
11:23:31.494 [ERROR] [org.gradle.internal.buildevents.BuildExceptionReporter] at org.gradle.internal.reflect.JavaMethod.invoke(JavaMethod.java:73)
11:23:31.494 [ERROR] [org.gradle.internal.buildevents.BuildExceptionReporter] at org.gradle.api.internal.project.taskfactory.IncrementalTaskAction.doExecute(IncrementalTaskAction.java:46)
11:23:31.494 [ERROR] [org.gradle.internal.buildevents.BuildExceptionReporter] at org.gradle.api.internal.project.taskfactory.StandardTaskAction.execute(StandardTaskAction.java:39)
11:23:31.495 [ERROR] [org.gradle.internal.buildevents.BuildExceptionReporter] at org.gradle.api.internal.project.taskfactory.StandardTaskAction.execute(StandardTaskAction.java:26)
11:23:31.495 [ERROR] [org.gradle.internal.buildevents.BuildExceptionReporter] at org.gradle.api.internal.tasks.execution.ExecuteActionsTaskExecuter$1.run(ExecuteActionsTaskExecuter.java:121)
11:23:31.495 [ERROR] [org.gradle.internal.buildevents.BuildExceptionReporter] at org.gradle.internal.progress.DefaultBuildOperationExecutor$RunnableBuildOperationWorker.execute(DefaultBuildOperationExecutor.java:336)
11:23:31.495 [ERROR] [org.gradle.internal.buildevents.BuildExceptionReporter] at org.gradle.internal.progress.DefaultBuildOperationExecutor$RunnableBuildOperationWorker.execute(DefaultBuildOperationExecutor.java:328)
11:23:31.495 [ERROR] [org.gradle.internal.buildevents.BuildExceptionReporter] at org.gradle.internal.progress.DefaultBuildOperationExecutor.execute(DefaultBuildOperationExecutor.java:199)
11:23:31.495 [ERROR] [org.gradle.internal.buildevents.BuildExceptionReporter] at org.gradle.internal.progress.DefaultBuildOperationExecutor.run(DefaultBuildOperationExecutor.java:110)
11:23:31.495 [ERROR] [org.gradle.internal.buildevents.BuildExceptionReporter] at org.gradle.api.internal.tasks.execution.ExecuteActionsTaskExecuter.executeAction(ExecuteActionsTaskExecuter.java:110)
11:23:31.495 [ERROR] [org.gradle.internal.buildevents.BuildExceptionReporter] at org.gradle.api.internal.tasks.execution.ExecuteActionsTaskExecuter.executeActions(ExecuteActionsTaskExecuter.java:92)
11:23:31.495 [ERROR] [org.gradle.internal.buildevents.BuildExceptionReporter] at org.gradle.api.internal.tasks.execution.ExecuteActionsTaskExecuter.execute(ExecuteActionsTaskExecuter.java:70)
11:23:31.495 [ERROR] [org.gradle.internal.buildevents.BuildExceptionReporter] at org.gradle.api.internal.tasks.execution.OutputDirectoryCreatingTaskExecuter.execute(OutputDirectoryCreatingTaskExecuter.java:51)
11:23:31.495 [ERROR] [org.gradle.internal.buildevents.BuildExceptionReporter] at org.gradle.api.internal.tasks.execution.SkipUpToDateTaskExecuter.execute(SkipUpToDateTaskExecuter.java:62)
11:23:31.495 [ERROR] [org.gradle.internal.buildevents.BuildExceptionReporter] at org.gradle.api.internal.tasks.execution.ResolveTaskOutputCachingStateExecuter.execute(ResolveTaskOutputCachingStateExecuter.java:54)
11:23:31.495 [ERROR] [org.gradle.internal.buildevents.BuildExceptionReporter] at org.gradle.api.internal.tasks.execution.ValidatingTaskExecuter.execute(ValidatingTaskExecuter.java:60)
11:23:31.495 [ERROR] [org.gradle.internal.buildevents.BuildExceptionReporter] at org.gradle.api.internal.tasks.execution.SkipEmptySourceFilesTaskExecuter.execute(SkipEmptySourceFilesTaskExecuter.java:97)
11:23:31.495 [ERROR] [org.gradle.internal.buildevents.BuildExceptionReporter] at org.gradle.api.internal.tasks.execution.CleanupStaleOutputsExecuter.execute(CleanupStaleOutputsExecuter.java:87)
11:23:31.495 [ERROR] [org.gradle.internal.buildevents.BuildExceptionReporter] at org.gradle.api.internal.tasks.execution.ResolveTaskArtifactStateTaskExecuter.execute(ResolveTaskArtifactStateTaskExecuter.java:52)
11:23:31.496 [ERROR] [org.gradle.internal.buildevents.BuildExceptionReporter] at org.gradle.api.internal.tasks.execution.SkipTaskWithNoActionsExecuter.execute(SkipTaskWithNoActionsExecuter.java:52)
11:23:31.496 [ERROR] [org.gradle.internal.buildevents.BuildExceptionReporter] at org.gradle.api.internal.tasks.execution.SkipOnlyIfTaskExecuter.execute(SkipOnlyIfTaskExecuter.java:54)
11:23:31.496 [ERROR] [org.gradle.internal.buildevents.BuildExceptionReporter] at org.gradle.api.internal.tasks.execution.ExecuteAtMostOnceTaskExecuter.execute(ExecuteAtMostOnceTaskExecuter.java:43)
11:23:31.496 [ERROR] [org.gradle.internal.buildevents.BuildExceptionReporter] at org.gradle.api.internal.tasks.execution.CatchExceptionTaskExecuter.execute(CatchExceptionTaskExecuter.java:34)
11:23:31.496 [ERROR] [org.gradle.internal.buildevents.BuildExceptionReporter] at org.gradle.execution.taskgraph.DefaultTaskGraphExecuter$EventFiringTaskWorker$1.run(DefaultTaskGraphExecuter.java:248)
11:23:31.496 [ERROR] [org.gradle.internal.buildevents.BuildExceptionReporter] at org.gradle.internal.progress.DefaultBuildOperationExecutor$RunnableBuildOperationWorker.execute(DefaultBuildOperationExecutor.java:336)
11:23:31.496 [ERROR] [org.gradle.internal.buildevents.BuildExceptionReporter] at org.gradle.internal.progress.DefaultBuildOperationExecutor$RunnableBuildOperationWorker.execute(DefaultBuildOperationExecutor.java:328)
11:23:31.496 [ERROR] [org.gradle.internal.buildevents.BuildExceptionReporter] at org.gradle.internal.progress.DefaultBuildOperationExecutor.execute(DefaultBuildOperationExecutor.java:199)
11:23:31.496 [ERROR] [org.gradle.internal.buildevents.BuildExceptionReporter] at org.gradle.internal.progress.DefaultBuildOperationExecutor.run(DefaultBuildOperationExecutor.java:110)
11:23:31.496 [ERROR] [org.gradle.internal.buildevents.BuildExceptionReporter] at org.gradle.execution.taskgraph.DefaultTaskGraphExecuter$EventFiringTaskWorker.execute(DefaultTaskGraphExecuter.java:241)
11:23:31.496 [ERROR] [org.gradle.internal.buildevents.BuildExceptionReporter] at org.gradle.execution.taskgraph.DefaultTaskGraphExecuter$EventFiringTaskWorker.execute(DefaultTaskGraphExecuter.java:230)
11:23:31.496 [ERROR] [org.gradle.internal.buildevents.BuildExceptionReporter] at org.gradle.execution.taskgraph.DefaultTaskPlanExecutor$TaskExecutorWorker.processTask(DefaultTaskPlanExecutor.java:123)
11:23:31.496 [ERROR] [org.gradle.internal.buildevents.BuildExceptionReporter] at org.gradle.execution.taskgraph.DefaultTaskPlanExecutor$TaskExecutorWorker.access$200(DefaultTaskPlanExecutor.java:79)
11:23:31.496 [ERROR] [org.gradle.internal.buildevents.BuildExceptionReporter] at org.gradle.execution.taskgraph.DefaultTaskPlanExecutor$TaskExecutorWorker$1.execute(DefaultTaskPlanExecutor.java:104)
11:23:31.496 [ERROR] [org.gradle.internal.buildevents.BuildExceptionReporter] at org.gradle.execution.taskgraph.DefaultTaskPlanExecutor$TaskExecutorWorker$1.execute(DefaultTaskPlanExecutor.java:98)
11:23:31.497 [ERROR] [org.gradle.internal.buildevents.BuildExceptionReporter] at org.gradle.execution.taskgraph.DefaultTaskExecutionPlan.execute(DefaultTaskExecutionPlan.java:626)
11:23:31.497 [ERROR] [org.gradle.internal.buildevents.BuildExceptionReporter] at org.gradle.execution.taskgraph.DefaultTaskExecutionPlan.executeWithTask(DefaultTaskExecutionPlan.java:581)
11:23:31.497 [ERROR] [org.gradle.internal.buildevents.BuildExceptionReporter] at org.gradle.execution.taskgraph.DefaultTaskPlanExecutor$TaskExecutorWorker.run(DefaultTaskPlanExecutor.java:98)
11:23:31.497 [ERROR] [org.gradle.internal.buildevents.BuildExceptionReporter] at org.gradle.internal.concurrent.ExecutorPolicy$CatchAndRecordFailures.onExecute(ExecutorPolicy.java:63)
11:23:31.497 [ERROR] [org.gradle.internal.buildevents.BuildExceptionReporter] at org.gradle.internal.concurrent.ManagedExecutorImpl$1.run(ManagedExecutorImpl.java:46)
11:23:31.497 [ERROR] [org.gradle.internal.buildevents.BuildExceptionReporter] at java.util.concurrent.ThreadPoolExecutor.runWorker(ThreadPoolExecutor.java:1142)
11:23:31.497 [ERROR] [org.gradle.internal.buildevents.BuildExceptionReporter] at java.util.concurrent.ThreadPoolExecutor$Worker.run(ThreadPoolExecutor.java:617)
11:23:31.497 [ERROR] [org.gradle.internal.buildevents.BuildExceptionReporter] at org.gradle.internal.concurrent.ThreadFactoryImpl$ManagedThreadRunnable.run(ThreadFactoryImpl.java:55)
11:23:31.497 [ERROR] [org.gradle.internal.buildevents.BuildExceptionReporter] at java.lang.Thread.run(Thread.java:745)
11:23:31.497 [ERROR] [org.gradle.internal.buildevents.BuildExceptionReporter] Caused by: com.android.ide.common.process.ProcessException: Failed to execute aapt
11:23:31.497 [ERROR] [org.gradle.internal.buildevents.BuildExceptionReporter] at com.android.builder.core.AndroidBuilder.processResources(AndroidBuilder.java:809)
11:23:31.497 [ERROR] [org.gradle.internal.buildevents.BuildExceptionReporter] at com.android.builder.core.AndroidBuilder.processResources(AndroidBuilder.java:797)
11:23:31.497 [ERROR] [org.gradle.internal.buildevents.BuildExceptionReporter] at com.android.build.gradle.internal.res.LinkApplicationAndroidResourcesTask.invokeAaptForSplit(LinkApplicationAndroidResourcesTask.java:491)
11:23:31.497 [ERROR] [org.gradle.internal.buildevents.BuildExceptionReporter] ... 42 more
11:23:31.497 [ERROR] [org.gradle.internal.buildevents.BuildExceptionReporter] Caused by: java.util.concurrent.ExecutionException: java.util.concurrent.ExecutionException: com.android.builder.internal.aapt.v2.Aapt2Exception: AAPT2 error: check logs for details
11:23:31.497 [ERROR] [org.gradle.internal.buildevents.BuildExceptionReporter] at com.google.common.util.concurrent.AbstractFuture.getDoneValue(AbstractFuture.java:503)
11:23:31.497 [ERROR] [org.gradle.internal.buildevents.BuildExceptionReporter] at com.google.common.util.concurrent.AbstractFuture.get(AbstractFuture.java:482)
11:23:31.497 [ERROR] [org.gradle.internal.buildevents.BuildExceptionReporter] at com.google.common.util.concurrent.AbstractFuture$TrustedFuture.get(AbstractFuture.java:79)
11:23:31.497 [ERROR] [org.gradle.internal.buildevents.BuildExceptionReporter] at com.android.builder.internal.aapt.AbstractAapt.link(AbstractAapt.java:34)
11:23:31.498 [ERROR] [org.gradle.internal.buildevents.BuildExceptionReporter] at com.android.builder.core.AndroidBuilder.processResources(AndroidBuilder.java:807)
11:23:31.498 [ERROR] [org.gradle.internal.buildevents.BuildExceptionReporter] ... 44 more
11:23:31.498 [ERROR] [org.gradle.internal.buildevents.BuildExceptionReporter] Caused by: java.util.concurrent.ExecutionException: com.android.builder.internal.aapt.v2.Aapt2Exception: AAPT2 error: check logs for details
11:23:31.498 [ERROR] [org.gradle.internal.buildevents.BuildExceptionReporter] at com.google.common.util.concurrent.AbstractFuture.getDoneValue(AbstractFuture.java:503)
11:23:31.498 [ERROR] [org.gradle.internal.buildevents.BuildExceptionReporter] at com.google.common.util.concurrent.AbstractFuture.get(AbstractFuture.java:462)
11:23:31.498 [ERROR] [org.gradle.internal.buildevents.BuildExceptionReporter] at com.google.common.util.concurrent.AbstractFuture$TrustedFuture.get(AbstractFuture.java:79)
11:23:31.498 [ERROR] [org.gradle.internal.buildevents.BuildExceptionReporter] at com.android.builder.internal.aapt.v2.QueueableAapt2.lambda$makeValidatedPackage$1(QueueableAapt2.java:166)
11:23:31.498 [ERROR] [org.gradle.internal.buildevents.BuildExceptionReporter] Caused by: com.android.builder.internal.aapt.v2.Aapt2Exception: AAPT2 error: check logs for details
11:23:31.498 [ERROR] [org.gradle.internal.buildevents.BuildExceptionReporter] at com.android.builder.png.AaptProcess$NotifierProcessOutput.handleOutput(AaptProcess.java:443)
11:23:31.498 [ERROR] [org.gradle.internal.buildevents.BuildExceptionReporter] at com.android.builder.png.AaptProcess$NotifierProcessOutput.err(AaptProcess.java:395)
11:23:31.498 [ERROR] [org.gradle.internal.buildevents.BuildExceptionReporter] at com.android.builder.png.AaptProcess$ProcessOutputFacade.err(AaptProcess.java:312)
11:23:31.498 [ERROR] [org.gradle.internal.buildevents.BuildExceptionReporter] at com.android.utils.GrabProcessOutput$1.run(GrabProcessOutput.java:104)
11:23:31.498 [ERROR] [org.gradle.internal.buildevents.BuildExceptionReporter]
11:23:31.498 [ERROR] [org.gradle.internal.buildevents.BuildExceptionReporter]
11:23:31.498 [ERROR] [org.gradle.internal.buildevents.BuildExceptionReporter] * Get more help at https://help.gradle.org
11:23:31.498 [ERROR] [org.gradle.internal.buildevents.BuildResultLogger]
11:23:31.498 [ERROR] [org.gradle.internal.buildevents.BuildResultLogger] BUILD FAILED in 7s

更多日志信息

解决方案:

在项目根目录下的gradle.properties文件(如果没有,新建)中添加以下配置:

# Project-wide Gradle settings.

# IDE (e.g. Android Studio) users:
# Gradle settings configured through the IDE *will override*
# any settings specified in this file. # For more details on how to configure your build environment visit
# http://www.gradle.org/docs/current/userguide/build_environment.html # Specifies the JVM arguments used for the daemon process.
# The setting is particularly useful for tweaking memory settings.
org.gradle.jvmargs=-Xmx1536m # When configured, Gradle will run in incubating parallel mode.
# This option should only be used with decoupled projects. More details, visit
# http://www.gradle.org/docs/current/userguide/multi_project_builds.html#sec:decoupled_projects
# org.gradle.parallel=true android.enableAapt2=false

原因:

AndroidStudio升级后,打开旧项目没问题,但是新建项目编译会报错:Errorcom.android.tools.aapt2.Aapt2Exception AAPT2 error check logs for details。在Google gradle插件升级到3.0之后(Google Gradle插件在项目根目录下的build.gradle中引入,参考下图),就默认启用了appt2,这么做是为了加快编译的速度。但是如果你的Gradle缓存目录不存在或者(一般在用户目录下,C:\Users\用户名\.gradle)中含有中文名称,那么就悲剧了,会出现上面的问题。个人总结原因是:Android Gradle 3.0之后对gradle缓存目录中的中文目录支持存在问题,所以导致了这样的错误。

运行日志

参考资料

AndroidStudio运行java的main方法

Execution failed for task ':app:processDebugResources'

Running “cordova build android” - unable to find attribute android:fontVariationSettings and android:ttcIndex

AndroidStudio升级后编译项目出现Aapt2Exception异常的问题解决方案

AndroidStudio运行java的main方法的更多相关文章

  1. JAVA运行内部类的main方法

    运行内部类的main方法 定义两个线程: 一个线程的名字"thread1",线程功能输出1~10的阶乘. 另一个线程的名字"thread2",线程功能输出线程的 ...

  2. Maven项目执行java入口main方法

    在Maven项目中配置pom.xml文件加载maven-surefire-plugin插件来执行testng.xml,相信大家对此种用法已经非常熟悉了.但是有些场景可能需要我们去加载执行java的ma ...

  3. 运行java程序的方法-DOS命令和Eclipse方法

    ● 运行java程序的方法(使用DOS命令) 首先进行一个"文件夹选项"的设置: 在D:\Android\java_code目录下新建了一个Hello_World.java文件(不 ...

  4. 为什么java的main方法必须是静态的

    今天看类型信息时发现一个问题,不能再main方法中打印this关键字的信息,这时想起了之前的知识,不能再静态方法中调用this.理由很简单,this表示“这个对象”,也就是声明一个类的对象,然而静态方 ...

  5. 1-为什么java的main方法必须是静态的

    为什么java的main方法必须是静态的   今天看类型信息时发现一个问题,不能再main方法中打印this关键字的信息,这时想起了之前的知识,不能再静态方法中调用this.理由很简单,this表示“ ...

  6. java中main方法的 (String []args)

    java中main方法的 (String []args)         String[] args是main函数的形式参数,可以用来获取命令行用户输入进去的参数.java 本身不存在不带String ...

  7. 【细说Java】揭开Java的main方法神秘的面纱

    大家都知道,main方法是Java应用程序的入口,其定义格式为: public static void main(String[] args) 可是为什么要这么定义呢?不这样定义可以么?main方法可 ...

  8. 【细说Java】揭开Java的main方法神秘的面纱(转)

    大家都知道,main方法是Java应用程序的入口,其定义格式为: public static void main(String[] args) 可是为什么要这么定义呢?不这样定义可以么?main方法可 ...

  9. 为什么Java的main方法必须是public static void?

    一. void 如下,像C, C++一样,将返回值类型改为int,再返回一个0,虽然编译通过,但是运行时会报错. 找到一种可理解的解释:方法的副作用和返回值类型.(http://www.cnblogs ...

随机推荐

  1. Shell脚本学习 - 函数,输入输出重定向,文件

    函数 函数定义 [ function ] funname [()] { action; [return int;] } 定义时可以是function fun(),也可以直接fun(),不带参数 返回值 ...

  2. Simple 杂题练手记

    Problem 1 世界上最可爱的珂朵莉 时间限制:C/C++ 1秒,空间限制:C/C++ 65536K 题目描述 我永远喜欢珂朵莉~! 有两个长为n的序列a[i]与b[i] 你可以把任意不多于x个a ...

  3. URI ,URL 和 URN

    URI : 统一资源标识符,用来唯一标识互联网资源,包括URL和URN URL:统一资源定位器 包含: 协议,域名,端口,路由,参数,hash https://i.cnblogs.com/EditPo ...

  4. MyBatis 缓存机制

    Mybatis 有两级缓存: 一级缓存: 也称为本地缓存,SqlSession级别的缓存.一级缓存是一直开启的: 与数据库同一次会话期间查询到的数据会放在本地缓存中,以后如果需要获取相同的数据,直接从 ...

  5. css实现文本超出两行隐藏

    当文字显示超出两行时,多余部分文字隐藏,用到的css属性如下代码 display: -webkit-box; text-overflow: ellipsis; overflow: hidden; -w ...

  6. 1、初识Java

    1.计算机发展过程 2.Java简史 lSUN公司是一家什么样的公司? 美国SUN(Stanford University Network)公司 在中国大陆的正式中文名为“太阳计算机系统(中国)有限公 ...

  7. Android完全退出应用的方法

    退出程序 public static void exitApp(Context context){ ActivityManager activityManager = (ActivityManager ...

  8. Round #2

    题源:来自hzwer整理的题 2014-5-10 NOIP模拟赛 by coolyangzc Problem 1 机器人(robot.cpp/c/pas) [题目描述] 早苗入手了最新的Gundam模 ...

  9. 用 PHP文件引入css样式

    html: <link rel="stylesheet" type="text/css" href="http://www.mysite.com ...

  10. linux学习:网络(防火墙)及系统安全相关命令学习

    指令: top.htop.free.pstree.lsof.ifconfig.w3m.tcpdump.netstat.nmap.ufw 网络: top    #查看内存,cpu,进程之间的状态.hto ...