jeecg报错:java.lang.Exception: No runnable methods
具体报错如下
-------------------------------------------------------
T E S T S
-------------------------------------------------------
Running org.jeecgframework.AbstractUnitTest
Tests run: 1, Failures: 0, Errors: 1, Skipped: 0, Time elapsed: 0.311 sec <<< FAILURE!
initializationError(org.jeecgframework.AbstractUnitTest) Time elapsed: 0.016 sec <<< ERROR!
java.lang.Exception: No runnable methods
at org.junit.runners.BlockJUnit4ClassRunner.validateInstanceMethods(BlockJUnit4ClassRunner.java:171)
at org.junit.runners.BlockJUnit4ClassRunner.collectInitializationErrors(BlockJUnit4ClassRunner.java:115)
at org.junit.runners.ParentRunner.validate(ParentRunner.java:269)
at org.junit.runners.ParentRunner.<init>(ParentRunner.java:66)
at org.junit.runners.BlockJUnit4ClassRunner.<init>(BlockJUnit4ClassRunner.java:59)
at org.springframework.test.context.junit4.SpringJUnit4ClassRunner.<init>(SpringJUnit4ClassRunner.java:103)
at sun.reflect.NativeConstructorAccessorImpl.newInstance0(Native Method)
at sun.reflect.NativeConstructorAccessorImpl.newInstance(NativeConstructorAccessorImpl.java:57)
at sun.reflect.DelegatingConstructorAccessorImpl.newInstance(DelegatingConstructorAccessorImpl.java:45)
at java.lang.reflect.Constructor.newInstance(Constructor.java:526)
at org.junit.internal.builders.AnnotatedBuilder.buildRunner(AnnotatedBuilder.java:31)
at org.junit.internal.builders.AnnotatedBuilder.runnerForClass(AnnotatedBuilder.java:24)
at org.junit.runners.model.RunnerBuilder.safeRunnerForClass(RunnerBuilder.java:57)
at org.junit.internal.builders.AllDefaultPossibilitiesBuilder.runnerForClass(AllDefaultPossibilitiesBuilder.java:29)
at org.junit.runners.model.RunnerBuilder.safeRunnerForClass(RunnerBuilder.java:57)
at org.junit.internal.requests.ClassRequest.getRunner(ClassRequest.java:24)
at org.apache.maven.surefire.junit4.JUnit4Provider.execute(JUnit4Provider.java:250)
at org.apache.maven.surefire.junit4.JUnit4Provider.executeTestSet(JUnit4Provider.java:141)
at org.apache.maven.surefire.junit4.JUnit4Provider.invoke(JUnit4Provider.java:112)
at sun.reflect.NativeMethodAccessorImpl.invoke0(Native Method)
at sun.reflect.NativeMethodAccessorImpl.invoke(NativeMethodAccessorImpl.java:57)
at sun.reflect.DelegatingMethodAccessorImpl.invoke(DelegatingMethodAccessorImpl.java:43)
at java.lang.reflect.Method.invoke(Method.java:606)
at org.apache.maven.surefire.util.ReflectionUtils.invokeMethodWithArray(ReflectionUtils.java:189)
at org.apache.maven.surefire.booter.ProviderFactory$ProviderProxy.invoke(ProviderFactory.java:165)
at org.apache.maven.surefire.booter.ProviderFactory.invokeProvider(ProviderFactory.java:85)
at org.apache.maven.surefire.booter.ForkedBooter.runSuitesInProcess(ForkedBooter.java:115)
at org.apache.maven.surefire.booter.ForkedBooter.main(ForkedBooter.java:75) Results : Tests in error:
initializationError(org.jeecgframework.AbstractUnitTest): No runnable methods Tests run: 1, Failures: 0, Errors: 1, Skipped: 0 [INFO] ------------------------------------------------------------------------
[INFO] BUILD FAILURE
[INFO] ------------------------------------------------------------------------
[INFO] Total time: 23.230 s
[INFO] Finished at: 2016-04-28T16:58:53+08:00
[INFO] Final Memory: 27M/146M
[INFO] ------------------------------------------------------------------------
[ERROR] Failed to execute goal org.apache.maven.plugins:maven-surefire-plugin:2.12.4:test (default-test) on project jeecg: There are test failures.
[ERROR]
[ERROR] Please refer to G:\java\jeecg\jeecg\target\surefire-reports for the individual test results.
[ERROR] -> [Help 1]
[ERROR]
[ERROR] To see the full stack trace of the errors, re-run Maven with the -e switch.
[ERROR] Re-run Maven using the -X switch to enable full debug logging.
[ERROR]
[ERROR] For more information about the errors and possible solutions, please read the following articles:
[ERROR] [Help 1] http://cwiki.apache.org/confluence/display/MAVEN/MojoFailureException
解决方案:
public class AbstractUnitTest
改成
public abstract class AbstractUnitTest
jeecg报错:java.lang.Exception: No runnable methods的更多相关文章
- 使用 JUnit 报错 java.lang.Exception: No runnable methods
错误详情如下: java.lang.Exception: No runnable methods at org.junit.runners.BlockJUnit4ClassRunner.validat ...
- junit 测试报错 java.lang.Exception: No runnable methods
转自:http://blog.csdn.net/snails_zx/article/details/51275894 在maven 项目中 建立测试类时,基类只用作加载spring配置文件,里面没有 ...
- java.lang.Exception: No runnable methods
java.lang.Exception: No runnable methods at org.junit.runners.BlockJUnit4ClassRunner.validateInstanc ...
- Junit4 java.lang.Exception: No runnable methods
出现如下错误: java.lang.Exception: No runnable methods at org.junit.runners.BlockJUnit4ClassRunner.validat ...
- java.lang.Exception: No runnable methods 解决方案
Running org.jeecgframework.AbstractUnitTest Tests run: 1, Failures: 0, Errors: 1, Skipped: 0, Time e ...
- java.lang.Exception: No runnable methods at org.junit.runners.BlockJUnit4ClassRunner.validateInstanceMethods(BlockJUnit4ClassRunner.java:191)
使用方法测试时出现以下错误 java.lang.Exception: No runnable methods at org.junit.runners.BlockJUnit4ClassRunner.v ...
- 谈一谈JUnit神奇的报错 java.lang.Exception:No tests found matching
最近在学习Spring+SpringMVC+MyBatis,一个人的挖掘过程确实有点艰难,尤其是有一些神奇的报错让你会很蛋疼.特别是接触一些框架还是最新版本的时候,会因为版本问题出现很多错误,欢迎大家 ...
- 在使用amoeba连接数据库时,报错java.lang.Exception: poolName=slaves, no valid pools
项目场景:Mysql 实现数据库读写分离 搭建3台MySQL服务器,完成主从复制,搭建一台amoeba服务器,完成MySQL的读写分离 问题描述: 问题1. 在服务搭建完毕后,利用客户机连接amoeb ...
- Hadoop运行jar包报错java.lang.Exception: java.lang.ArrayIndexOutOfBoundsException: 1
错误信息: java.lang.Exception: java.lang.ArrayIndexOutOfBoundsException: 1 at org.apache.hadoop.mapre ...
随机推荐
- Android 使用pl.droidsonroids.gif.GifImageView在安卓中显示动图遇到的问题
在做一款聊天软件,其中聊天界面需要发送表情,而表情都是动图,在安卓中想要显示动图,就要借助第三方框架,我选的是pl.droidsonroids.gif.GifImageView. 使用方法如下:你在g ...
- iOS Programming UIWebView 2
iOS Programming UIWebView 1 Instances of UIWebView render web content. UIWebView可以显示web content. In ...
- struts2的action是线程安全的,struts1的action不是线程安全的真正原因
为什么struts2的action是线程安全的,struts1的action不是线程安全的? 先对struts1和struts2的原理做一个简单的讲解 对于struts1 ,当第一次**.do的请求过 ...
- Delphi win10 asssertion failure
Delphi2007 原来安装在Win7 下 运行正常, 自从升级到Win10 ,新建工程运行然后关闭报错, 报错信息如下: ---------------------------bds.exe - ...
- bat获取注册表值
@echo off Setlocal enabledelayedexpansion for /f "skip=2 delims=: tokens=1,*" %%i in ('reg ...
- Windos无法验证文件数组签名
参考链接:https://jingyan.baidu.com/article/09ea3ede6982c4c0aede39e6.html Windows无法验证文件数字签名而无法启动,照以下去做,可以 ...
- Python机器学习——DBSCAN聚类
密度聚类(Density-based Clustering)假设聚类结构能够通过样本分布的紧密程度来确定.DBSCAN是常用的密度聚类算法,它通过一组邻域参数(ϵϵ,MinPtsMinPts)来描述样 ...
- struts2与常用表格ajax操作的json传值问题
struts与常用的dataTables和jqueryGrid等表格进行ajax传值时,经常会传值不适配的问题,这是因为struts在进行ajax操作时已经对你要操作的json数据进行了处理,所以不需 ...
- 2019ICPC西安邀请赛(计蒜客复现赛)总结
开始时因为吃饭晚了一刻钟,然后打开比赛.看了眼榜单A题已经过了二十来个队伍了,宝儿就去做A. 传师说最后一题看题目像最短路,于是我就去看M了,宝儿做完之后也来陪我看.M一开始看到时以为是像 POJ ...
- 动态规划----最长公共子序列(C++实现)
最长公共子序列 题目描述:给定两个字符串s1 s2 … sn和t1 t2 … tm .求出这两个字符串的最长公共子序列的长度.字符串s1 s2 … sn的子序列指可以表示为 … { i1 < i ...