1. java.lang.Exception: No runnable methods
  2. at org.junit.runners.BlockJUnit4ClassRunner.validateInstanceMethods(BlockJUnit4ClassRunner.java:169)
  3. at org.junit.runners.BlockJUnit4ClassRunner.collectInitializationErrors(BlockJUnit4ClassRunner.java:104)
  4. at org.junit.runners.ParentRunner.validate(ParentRunner.java:355)
  5. at org.junit.runners.ParentRunner.<init>(ParentRunner.java:76)
  6. at org.junit.runners.BlockJUnit4ClassRunner.<init>(BlockJUnit4ClassRunner.java:57)
  7. at org.springframework.test.context.junit4.SpringJUnit4ClassRunner.<init>(SpringJUnit4ClassRunner.java:104)
  8. at sun.reflect.NativeConstructorAccessorImpl.newInstance0(Native Method)
  9. at sun.reflect.NativeConstructorAccessorImpl.newInstance(NativeConstructorAccessorImpl.java:57)
  10. at sun.reflect.DelegatingConstructorAccessorImpl.newInstance(DelegatingConstructorAccessorImpl.java:45)
  11. at java.lang.reflect.Constructor.newInstance(Constructor.java:526)
  12. at org.junit.internal.builders.AnnotatedBuilder.buildRunner(AnnotatedBuilder.java:29)
  13. at org.junit.internal.builders.AnnotatedBuilder.runnerForClass(AnnotatedBuilder.java:21)
  14. at org.junit.runners.model.RunnerBuilder.safeRunnerForClass(RunnerBuilder.java:59)
  15. at org.junit.internal.builders.AllDefaultPossibilitiesBuilder.runnerForClass(AllDefaultPossibilitiesBuilder.java:26)
  16. at org.junit.runners.model.RunnerBuilder.safeRunnerForClass(RunnerBuilder.java:59)
  17. at org.junit.internal.requests.ClassRequest.getRunner(ClassRequest.java:26)
  18. at org.eclipse.jdt.internal.junit4.runner.JUnit4TestReference.<init>(JUnit4TestReference.java:33)
  19. at org.eclipse.jdt.internal.junit4.runner.JUnit4TestClassReference.<init>(JUnit4TestClassReference.java:25)
  20. at org.eclipse.jdt.internal.junit4.runner.JUnit4TestLoader.createTest(JUnit4TestLoader.java:48)
  21. at org.eclipse.jdt.internal.junit4.runner.JUnit4TestLoader.loadTests(JUnit4TestLoader.java:38)
  22. at org.eclipse.jdt.internal.junit.runner.RemoteTestRunner.runTests(RemoteTestRunner.java:452)
  23. at org.eclipse.jdt.internal.junit.runner.RemoteTestRunner.runTests(RemoteTestRunner.java:683)
  24. at org.eclipse.jdt.internal.junit.runner.RemoteTestRunner.run(RemoteTestRunner.java:390)
  25. at org.eclipse.jdt.internal.junit.runner.RemoteTestRunner.main(RemoteTestRunner.java:197)

没有可运行的方法

因为没有在测试类中的对应方法上面加@Test注解

java.lang.Exception: No runnable methods的更多相关文章

  1. 使用 JUnit 报错 java.lang.Exception: No runnable methods

    错误详情如下: java.lang.Exception: No runnable methods at org.junit.runners.BlockJUnit4ClassRunner.validat ...

  2. Junit4 java.lang.Exception: No runnable methods

    出现如下错误: java.lang.Exception: No runnable methods at org.junit.runners.BlockJUnit4ClassRunner.validat ...

  3. java.lang.Exception: No runnable methods 解决方案

    Running org.jeecgframework.AbstractUnitTest Tests run: 1, Failures: 0, Errors: 1, Skipped: 0, Time e ...

  4. java.lang.Exception: No runnable methods at org.junit.runners.BlockJUnit4ClassRunner.validateInstanceMethods(BlockJUnit4ClassRunner.java:191)

    使用方法测试时出现以下错误 java.lang.Exception: No runnable methods at org.junit.runners.BlockJUnit4ClassRunner.v ...

  5. jeecg报错:java.lang.Exception: No runnable methods

    具体报错如下 ------------------------------------------------------- T E S T S --------------------------- ...

  6. junit 测试报错 java.lang.Exception: No runnable methods

    转自:http://blog.csdn.net/snails_zx/article/details/51275894 在maven 项目中  建立测试类时,基类只用作加载spring配置文件,里面没有 ...

  7. JUnit测试提示Java.lang.Exception: No runnable methods

    网上一大堆都说,没写@Test,或者是,导包错误,= =然而我并没有发现我有这个毛病 = =最后终于找到罪魁祸首 Junit版本太低!!! Junit版本太低!!! Junit版本太低!!! = =因 ...

  8. 异常-User class threw exception: java.lang.IllegalStateException: Cannot call methods on a stopped SparkContext.

    1 详细信息 User class threw exception: java.lang.IllegalStateException: Cannot call methods on a stopped ...

  9. java.lang.Exception: DEBUG -- CLOSE BY CLIENT STACK TRACE 的理解

    [2013-12-06 11:06:21,715] [C3P0PooledConnectionPoolManager[identityToken->2tl0n98y1iwg7cbdzzq7a|7 ...

随机推荐

  1. [No00003C]操作系统Operating Systems进程同步与信号量Processes Synchronization and Semaphore

    操作系统Operating Systems进程同步与信号量Processes Synchronization and Semaphore 进程合作:多进程共同完成一个任务 从纸上到实际:生产者− − ...

  2. java 24 - 2 GUI之监听机制和适配器改进窗口关闭

    我们创建了窗体后,就要对窗体进行操作,比如关闭窗口.而这时候就要建立监听机制: 事件监听机制: A:事件源 事件发生的地方 B:事件 就是要发生的事情 C:事件处理 就是针对发生的事情做出的处理方案 ...

  3. Android应用性能测试

    Android应用性能测试 Android用户也许会经常碰到以下的问题: 1)应用后台开着,手机很快没电了——应用耗电大 2)首次/非首次启动应用,进入应用特别慢——应用启动慢 3)应用使用过程中,越 ...

  4. 在AppDelegate 或其它地方用UITabBarController怎么办

    1.解决了TabBarController,每个地方都要用到的时候?     创建一个单例,然后在创建UITabBarController时,赋值给这个单例,不管是登录还是抽屉,保证最终的根控制器是U ...

  5. 逗号分隔的字符串转换为行数据(collection)

    逗号分隔的字符串转换为行数据(collection) CREATE OR REPLACE FUNCTION "GET_STR_TAB" (v_str in varchar2) re ...

  6. Linux虚拟机突然不能上网了

    之前是可以的,然后这次打开突然不能上网了. 更改配置后就好了: 配置如下: 我的问题是打开打开之后变成了OFF不是ON了.然后不管怎么改变O都失败了. 改为: 这样虚拟机这边就好了. 我们看下wind ...

  7. java:读/写配置文件

    package jimmy; import java.io.*; import java.util.Properties; public class Program { public static v ...

  8. Webwork 学习之路【05】请求跳转前 xwork.xml 的读取

    个人理解 WebWork 与 Struts2 都是将xml配置文件作为 Controler 跳转的基本依据,WebWork 跳转 Action 前 xml 文件的读取依赖 xwork-1.0.jar, ...

  9. 用jQuery File Upload做的上传控件demo,支持同页面多个上传按钮

    需求 有这么一个需求,一个form有多个文件要上传,但又不是传统的图片批量上传那种,是类似下图这种需求,一开始是用的swfupload做的上传,但是问题是如果有多个按钮的话,就要写很多重复的代码,于为 ...

  10. PHP 页面跳转方法

    1.php header()函数跳转 PHP的header()函数非常强大,其中在页面url跳转方面也调用简单,使用header()直接跳转到指定url页面,这时页面跳转是302重定向: $url = ...