注解配置时报错:org.hibernate.MappingException: Unknown entity: net.mingyang.cms.bean.User

org.hibernate.MappingException: Unknown entity: net.mingyang.cms.bean.User
at org.hibernate.internal.SessionFactoryImpl.getEntityPersister(SessionFactoryImpl.java:1096)
at org.hibernate.internal.SessionImpl.getEntityPersister(SessionImpl.java:1443)
at org.hibernate.engine.internal.ForeignKeys.isTransient(ForeignKeys.java:242)
at org.hibernate.event.internal.AbstractSaveEventListener.getEntityState(AbstractSaveEventListener.java:511)
at org.hibernate.event.internal.DefaultSaveOrUpdateEventListener.performSaveOrUpdate(DefaultSaveOrUpdateEventListener.java:100)
at org.hibernate.event.internal.DefaultSaveOrUpdateEventListener.onSaveOrUpdate(DefaultSaveOrUpdateEventListener.java:90)
at org.hibernate.internal.SessionImpl.fireSaveOrUpdate(SessionImpl.java:684)
at org.hibernate.internal.SessionImpl.saveOrUpdate(SessionImpl.java:676)
at org.hibernate.internal.SessionImpl.saveOrUpdate(SessionImpl.java:671)
at net.mingyang.cms.dao.hibernate.UserDaoHibernate.updateUser(UserDaoHibernate.java:34)
at net.mingyang.cms.service.impl.UserServiceImpl.updateUser(UserServiceImpl.java:50)
at net.mingyang.cms.controller.UserController.indexAction(UserController.java:61)
. . . . . .

可能的原因:
1、配置实体类时为@Entity导包时错误的导入了 rg.hibernate.annotations.Entity ,应该更改为import javax.persistence.Entity;
2、applicationContext.xml中配置实体扫描时路径出错, 比如:实体类存放在net.mingyang.cms.bean包下,则路径就要配为

<property name="packagesToScan" value="net.mingyang.cms.*"/>

而不是

<property name="packagesToScan" value="net.mingyang.cms.bean.*"/>

也就是说配置映射目录要比实际少一层。 
或者直接使用

<property name="annotatedClasses">
<list>
<value>net.mingyang.cms.bean.User</value>
......
</list>
</property>

指定相应的实体类(实体类较少时)。

Mingyang.net:注解配置Hibernate时报错Unknown Entity的更多相关文章

  1. Vue+Webpack配置css-loader时报错:Module build failed: Unknown word

    使用Vue+Webpack搭建工程时,在webpack.config.js中的module的rules里针对各种文件配置加载工具.在针对css文件配置时遇到一个问题:打包构建时报错——Module b ...

  2. insmod 时报错“Unknown symbol”问题的解决

    在加载驱动模块时报错: “ Unknown symbol CFG80211_SupBandReInit (err 0)” 查看了内核代码以及加载上的symbol(命令为 cat /proc/kalls ...

  3. python控制selenium点击登录按钮时报错 unknown error: Element is not clickable at point

    利用python控制selenium进行一个网页的登录时报错: C:\Users\Desktop\selenium\chrome>python chrome.py selenium.common ...

  4. spring整合hibernate时报错:org.hibernte.engine.transaction.spi.transactioncontext

    错误提示:Caused by:java.lang.ClassNotFoundException: org.hibernte.engine.transaction.spi.transactioncont ...

  5. vue配置路由时报错 Error in render: "RangeError: Maximum call stack size exceeded"

    虽然标题写的是配置路由报错,最终也是通过修改路由解决的,但是导致报错的还有一个主要因素,是因为我增加了一个功能“页面刷新时,根据url高亮左侧导航”,如下图: 1.页面刷新,根据url高亮左侧导航代码 ...

  6. hibernate报错Unknown integral data type for ids : java.lang.String

    package com.model; // Generated 2016-10-27 14:02:17 by Hibernate Tools 4.3.1.Final /** * CmDept gene ...

  7. 使用lombok的@Data @NoArgsConstructor @AllArgsConstructor @EqualsAndHashCode注解,编译时报错 找不到符号

    使用lombok添加@AllArgsConstructor后报错"错误:找不到符号 符号: 问题:未启用lombok注解 解决: settings->build->compile ...

  8. xcodebuild构建时报错unknown error -1=ffffffffffffffff Command /bin/sh failed with exit code 1

    CI今日构建时报出如下错误: /Users/xxx/Library/Developer/Xcode/DerivedData/Snowball-ebllohyukujrncbaldsfojfjxwep/ ...

  9. 使用odbc从notes中导数据,配置odbc时报错

    上次在配置odbc从notes中导数据时一直报错(忘记是什么错误了),后来,尝试着把notes和notesSQL的路径加入到path中就OK了!

随机推荐

  1. .net 开源 JavaScript 解析引擎

    1. Javascript .NET 地址为:http://javascriptdotnet.codeplex.com/ 使用方法: Quick Start This section provides ...

  2. webpack需要全局安装,才能使用webpack命令

    webpack全局安装,具体项目中才能使用webpack命令: npm install webpack -g

  3. maven NoClassDefFoundError: org/mortbay/util/Attributes

    在运行mvn jetty:run报错: NoClassDefFoundError: org/mortbay/util/Attributes 解决方法: deleted /home/jenkins/.m ...

  4. mysql 10进制与35进制之间的转换 注意Power处理bigint的问题

    35进制的目的是防止0和O造成的视觉误差 BEGIN    DECLARE m_StrHex35 VARCHAR(100); -- 返回35进制表示的结果  DECLARE m_Remainder B ...

  5. Android 网络编程 Socket

    1.服务端开发 创建一个Java程序 public class MyServer { // 定义保存所有的Socket,与客户端建立连接得到一个Socket public static List< ...

  6. PHP 开发环境配置

    使用phpStudy +Zend Studio 使用phpStudy +Zend Studio ,这个组合是我个人使用的比较好的,现在分享出来.一.phpStudy简体中文版 该程序包集成最新的Apa ...

  7. window7 下 安装 apache24(httpd-2.4.10-x86-r2)加 php5.6(php-5.6.4-Win32-VC11-x86)加yaf(php_yaf-2.3.3-5.6-ts-vc11-x86)整合

    window7 下 安装 apache24(httpd-2.4.10-x86-r2)加 php5.6(php-5.6.4-Win32-VC11-x86)加yaf(php_yaf-2.3.3-5.6-t ...

  8. .Net分布式缓存应用实例:Couchbase

    转自:http://www.cnblogs.com/wu-jian Couchbase概述 Couchbase最早叫Membase,是由Memcached项目组的一些头目另立的山头. 2011年与Co ...

  9. [oracle] ORA-08002:序列XXXXXXX.CURRVAL尚未在此进程中定义

    出现 ORA-08002: 序列XXXXXXX.CURRVAL 尚未在此进程中定义. 导致原因:因为是首次查询序列的当前值,内存中之前并没有缓存序列的任何值,所以需要先查询 一下序列的下一个值(此时, ...

  10. JST(JavaScript Trimpath)前端模板引擎简介

    JST(JavaScript Trimpath)前端模板引擎简介及应用 今天在做某系统日志列表的时候用到了这个玩意儿.刚开始只是根据别人的例子照葫芦画瓢完成了日志列表及对应详情,晚上有空了才仔细去网上 ...