linker command failed with exit code 1 (use -v to see
转自 :http://www.reader8.cn/jiaocheng/20131022/2003334.html
Undefined symbols for architecture http://www.reader8.cn/jiaocheng/20131022/2003334.html:
"_utf8_nextCharSafeBody", referenced from:
-[SRWebSocket _innerPumpScanner] in AVOSCloud(SRWebSocket.o)
ld: symbol(s) not found for architecture armv7
clang: error: linker command failed with exit code 1 (use -v to see invocation)
我是用pod添加的avos,之前使用过多次avos都没出现过问题,这次莫名奇妙出现了这个问题,不知道少引了什么。。。
这是因为从 2.5.9 开始,AVOSCloud 增加了实时通信的功能, 会依赖 libicucore.dylib 。
linker command failed with exit code 1 (use -v to see invocation)的错误调试情况1、linker command fai
linker command failed with exit code 1 (use -v to see invocation)的错误调试
情况1、
linker command failed with exit code 1 (use -v to see invocation)这个错误貌似遇见并不止一次,当我想用某个第三方类库的时候(如SBJson),我直接把类库文件copy到工程目录里面,然后一编译就出现这样错误(并不是一定会出这样错误),开始以为是网上下载的类库本身问题,所以重新找类库或者其他方式将它添加进去,只要不出错就行,也一直没有深入了解根本问题,今天在给工程添加一个FMDB(SQLIte第三方类库)文件编译时又出现这种错误,一开始以为工程问题,但是新建工程后还是出现这个问题,经过网上查找,得到了解决办法;
[cpp] view plaincopy
- Undefined symbols for architecture i386:
- "_OBJC_CLASS_$_FMDatabase", referenced from:
- objc-class-ref in ViewController.o
- ld: symbol(s) not found for architecture i386
- clang: error: linker command failed with exit code 1 (use -v to see invocation)

在网上得到解决办法是:
在工作左边导航栏Target-->Build Phases-->compile Sources中,第三库库的所有.m文件都添加到里面,然后编译通过了;

添加.m文件

根据对比可以看见 in FMDBTest,FMDBTest的Target里添加进去了了一些.m文件

对于以上错误,根据网友解答我的理解是
我们在使用这些第三方类库文件时直接将其拖拽到工程之中,编译的的时候Xcode也没有自动引用,所以造成这样错误,这就需要我们手动添加。假如我们在工程中新建某个文件就不会出现这样问题;
参考 http://blog.hsin.tw/2012/ios-dev-undefined-symbols-for-architecture-i386/
情况2、
linker command failed with exit code 1 (use -v to see invocation)
出现这种情况很可能是,项目中引入了多个相同的文件。删除一个就ok!
情况3、
xcoder的一个编译错误:
linker command failed with exit code 1 (use -v to see invocation)
说明有无法准确找到的函数,函数有重复现象。
造成这个错误的原因是我直接在 .h头文件中实现了几个函数,然后这个头文件又被别的.c文件所引用,有实现的。
所以解决办法是把实现的几个函数单出一个.c文件里去。这样就ok了。
情况4、
把 Valid Architectures 的值改为 armv7
过程:
PROJECT --> Build Settings --> Architectures --> Valid Architectures 他的值本来是 armv7 armv7s (ios6.0下) 把armv7s 去掉即可
同样的操作
TARGETS --> Build Settings --> Architectures --> Valid Architectures 做同样的修改
情况5、 很奇葩的情况啊,就是引用第三方的静态库.a 出现了问题. 在模拟器和真机引入的静态库是分开的!!!当然如果你的静态库做成了统一的,那就不会出现情况5.
linker command failed with exit code 1 (use -v to see的更多相关文章
- symbol(s) not found for architecture x86_64 之 linker command failed with exit code 1 (use -v to see invocation)解决方案排查
这样的错误 ,我的解决方案是, 第一种: 查看他说在 ****.o 中,你要查看这样的关键点,然后去查看,你 项目中有没有引进这样的文件,在项目中查找,看项目中有没有,如果没有那就是没添加进来,你 ...
- linker command failed with exit code 1 (use -v to see invocation)
背景:用U盘从另一台电脑考过来后,出现错误 linker command failed with exit code 1 (use -v to see invocation) 出现这种情况很可能是,项 ...
- linker command failed with exit code 1 (use -v to see invocation)解决办法
[cpp] view plaincopy Undefined symbols for architecture i386: "_OBJC_CLASS_$_FMDatabase&quo ...
- clang: error: linker command failed with exit code 1 (use -v to see invocation)
报错提示: ... ld: 6 duplicate symbols for architecture x86_64 clang: error: linker command failed with e ...
- IOS Bugs5 linker command failed with exit code 1 (use -v to see invocation)
Ld /Users/Rubert/Library/Developer/Xcode/DerivedData/OC_Language-emftyzftyvhdpuaxipddjmpnpvox/Build/ ...
- [Bug-IOS] - linker command failed with exit code 1 (use -v to see invocation)
Ld /Users/Rubert/Library/Developer/Xcode/DerivedData/OC_Language-emftyzftyvhdpuaxipddjmpnpvox/Build/ ...
- (转) error: linker command failed with exit code 1 (use -v to see invocation)
转自:http://blog.csdn.net/tiantian1980/article/details/9175777 像这样的一大堆,总体说编译链接时错误 /Users/zhangtianji ...
- 添加第三方类库造成的linker command failed with exit code 1 (use -v to see invocation)的错误调试
linker command failed with exit code 1 (use -v to see invocation)这个错误貌似遇见并不止一次,当我想用某个第三方类库的时候(如SBJso ...
- linker command failed with exit code 1 (use -v to see invocation),经典Xcode编译错误的出现和解决!
linker command failed with exit code 1 (use -v to see invocation)这个肯定是个xcode编译运行的时候经典的报错了. 这个问题曾经在我的 ...
- 使用SVN clang: error: linker command failed with exit code 1 (use -v to see invocation)
然后上传到该项目SVN仓库上,例如,下面的错误再次发生再拉到本地编译 ld: library not found for -lxxxxxxxxxxxx clang: error: linker com ...
随机推荐
- 安装配置Postgresql
//关闭selinuxgetenforcesetenfroce 0vi /etc/selinux/configSELINUX=disabledSELINUXTYPE=targeted//关闭防火墙#c ...
- delphi 帮助文档(中英对译)下载地址
文档下载地址:http://download.csdn.net/detail/yangzhimars/5014350
- EntityFramework批量Insert
先说解决办法:使用SqlBulkCopy. 然后问题是:这个和EF没有半点关系,还要拼DataSet. 再是解决办法:你可以自己封装一个,也可以使用人家写好的 EntityFramework.Bulk ...
- C++类与static
到目前为止,我们设计的类中所有的成员变量和成员函数都是属于对象的,如我们在前面定义的book类,利用book类声明两个对象Alice和Harry,这两个对象均拥有各自的price和title成员变量, ...
- TCP跟UDP乱侃
原文链接http://www.cnblogs.com/xiaoEight/archive/2013/02/19/2917814.html 由于最近在恶补关于网络编程的东西,所以决定做个简单的记录.之前 ...
- android的签名
安装好了android studio,默认是使用期限为一年的签名,并且不可以发布到正式版的apk里. 在使用第三方模块或者服务的时候,经常要求提供签名及其sha1或者MD5信息. 事实上这个签名和及其 ...
- 利用StringBuffer向字符串特定的重复子字符串插入数据
public class InsertDetail { public void insertInvoiceDetail(StringBuffer sb, String Label, String ...
- 昨天面试遇到的一道C语言题
楼主之前是做C/C++开发的,今年转到java,hadoop方向了,所以很多C/C++的细节都有些模糊了,碰巧这次面试题中,就出了一道C指针的问题. 问题不算难,但楼主一时之间竟也想不起来答案了... ...
- HDU - 2290 Find the Path(最短路)
HDU - 2290 Find the Path Time Limit: 5000MS Memory Limit: 64768KB 64bit IO Format: %I64d & % ...
- HBase表删除问题
HBase shell下用list命令查看表,出现错误:找不到表 格式化zookeeper,删除.opt/zookeeper下除了myid的文件 重启集群 再进入HBase shell,list可以查 ...