写了一个单元测试test来启动activiti,controller放在src/main/java根目录下,test对应也放在src/test/java下,结果报错:

 java.lang.IllegalStateException: Unable to find a @SpringBootConfiguration, you need to use @ContextConfiguration or @SpringBootTest(classes=...) with your test
at org.springframework.util.Assert.state(Assert.java:70)
at org.springframework.boot.test.context.SpringBootTestContextBootstrapper.getOrFindConfigurationClasses(SpringBootTestContextBootstrapper.java:202)
at org.springframework.boot.test.context.SpringBootTestContextBootstrapper.processMergedContextConfiguration(SpringBootTestContextBootstrapper.java:137)
at org.springframework.test.context.support.AbstractTestContextBootstrapper.buildMergedContextConfiguration(AbstractTestContextBootstrapper.java:409)
at org.springframework.test.context.support.AbstractTestContextBootstrapper.buildDefaultMergedContextConfiguration(AbstractTestContextBootstrapper.java:323)
at org.springframework.test.context.support.AbstractTestContextBootstrapper.buildMergedContextConfiguration(AbstractTestContextBootstrapper.java:277)
at org.springframework.test.context.support.AbstractTestContextBootstrapper.buildTestContext(AbstractTestContextBootstrapper.java:112)
at org.springframework.boot.test.context.SpringBootTestContextBootstrapper.buildTestContext(SpringBootTestContextBootstrapper.java:82)
at org.springframework.test.context.TestContextManager.<init>(TestContextManager.java:120)
at org.springframework.test.context.TestContextManager.<init>(TestContextManager.java:105)
at org.springframework.test.context.junit4.SpringJUnit4ClassRunner.createTestContextManager(SpringJUnit4ClassRunner.java:152)
at org.springframework.test.context.junit4.SpringJUnit4ClassRunner.<init>(SpringJUnit4ClassRunner.java:143)
at org.springframework.test.context.junit4.SpringRunner.<init>(SpringRunner.java:49)
at sun.reflect.NativeConstructorAccessorImpl.newInstance0(Native Method)
at sun.reflect.NativeConstructorAccessorImpl.newInstance(Unknown Source)
at sun.reflect.DelegatingConstructorAccessorImpl.newInstance(Unknown Source)
at java.lang.reflect.Constructor.newInstance(Unknown Source)
at org.junit.internal.builders.AnnotatedBuilder.buildRunner(AnnotatedBuilder.java:104)
at org.junit.internal.builders.AnnotatedBuilder.runnerForClass(AnnotatedBuilder.java:86)
at org.junit.runners.model.RunnerBuilder.safeRunnerForClass(RunnerBuilder.java:59)
at org.junit.internal.builders.AllDefaultPossibilitiesBuilder.runnerForClass(AllDefaultPossibilitiesBuilder.java:26)
at org.junit.runners.model.RunnerBuilder.safeRunnerForClass(RunnerBuilder.java:59)
at org.junit.internal.requests.ClassRequest.getRunner(ClassRequest.java:33)
at org.eclipse.jdt.internal.junit4.runner.JUnit4TestLoader.createUnfilteredTest(JUnit4TestLoader.java:87)
at org.eclipse.jdt.internal.junit4.runner.JUnit4TestLoader.createTest(JUnit4TestLoader.java:73)
at org.eclipse.jdt.internal.junit4.runner.JUnit4TestLoader.loadTests(JUnit4TestLoader.java:46)
at org.eclipse.jdt.internal.junit.runner.RemoteTestRunner.runTests(RemoteTestRunner.java:523)
at org.eclipse.jdt.internal.junit.runner.RemoteTestRunner.runTests(RemoteTestRunner.java:761)
at org.eclipse.jdt.internal.junit.runner.RemoteTestRunner.run(RemoteTestRunner.java:461)
at org.eclipse.jdt.internal.junit.runner.RemoteTestRunner.main(RemoteTestRunner.java:207)

原因:Application.java中的main方法和启动有关,我们写的类必须放在Application.java同一级或者比它更里层的目录。

正确的做法 如图:

Application.java的目录是:“a/Application.java”,那么myActiviti目录必须也放到“a”目录下。

报错的原因是:我把myActiviti放到“src/main/java”下了

java.lang.IllegalStateException: Unable to find a @SpringBootConfiguration, you need to use @ContextConfiguration or @SpringBootTest(classes=...) with your test的更多相关文章

  1. maven打包错误:java.lang.IllegalStateException: Unable to find a @SpringBootConfiguration, you need to use @ContextConfiguration or @SpringBootTest(classes=...) with your test

    Tests run: 1, Failures: 0, Errors: 1, Skipped: 0, Time elapsed: 0.118 sec <<< FAILURE! - in ...

  2. springboot测试启动报错java.lang.IllegalStateException: Unable to find a @SpringBootConfiguration, you need to use @ContextConfiguration or @SpringBootTest(classes=...) with your test

    springboot测试启动报错: java.lang.IllegalStateException: Unable to find a @SpringBootConfiguration, you ne ...

  3. SpringBoot测试类启动错误 java.lang.IllegalStateException: Unable to find a @SpringBootConfiguration, you need to use @ContextConfiguration or @SpringBootTest(classes=...) with your test

    报错 java.lang.IllegalStateException: Unable to find a @SpringBootConfiguration, you need to use @Cont ...

  4. 使用SpringBoot整合MybatisPlus出现 : java.lang.IllegalStateException: Unable to find a @SpringBootConfiguration, you need to use @ContextConfiguration or @SpringBootTest(classes=...) with your test

    解决方案一: 将测试类的包路径改为和主启动类的一致 解决方法二: 不想改测试类的路径 就在测试类上添加要测试的类的classes

  5. java.lang.IllegalStateException Unable to find a @SpringBootConfiguration错误解决方案

    问题描述:java.lang.IllegalStateException: Unable to find a @SpringBootConfiguration, you need to use @Co ...

  6. Unable to find a @SpringBootConfiguration, you need to use @ContextConfiguration or @SpringBootTest(classes=...) with your test java.lang.IllegalStateException

    不能找到对应的带有@SpringBootConfiguration 的类,你需要将它放在包的最顶层.

  7. myeclipse 无法启动 java.lang.IllegalStateException: Unable to acquire application service. Ensure that the org.eclipse.core.runtime bundle is resolved and started (see config.ini).

    把myeclipse10 按照目录完整拷贝到了另外一台电脑, 另外的目录 原安装目录 D\:\soft\i\myeclipse10 新安装目录 E\:\soft\myeclipse10 双击启动失败, ...

  8. Caused by: java.lang.IllegalStateException: Unable to complete the scan for annotations for web application [/Cppcc] due to a StackOverflowError. Possible root causes include a too low setting for -Xs

    解决办法:(1)修改D:\Java\apache-tomcat-7.0.88\conf\catalina.properties (122line) (2)如org.apache.catalina.st ...

  9. tomcat启动时检测到循环继承而栈溢出的问题:Caused by: java.lang.IllegalStateException: Unable to complete the scan for annotations for web application [/test] due to a StackOverflowError. Possible root causes include

    最近在公司更新一个老项目的时候,发现部署项目后tomcat报错,错误如下: Caused by: java.lang.IllegalStateException: Unable to complete ...

随机推荐

  1. C# Chart使用总结 2 ----属性

    默认显示如图所示,Series的名称显示在右边,它会将下方空间挤掉,使图表只能显示在左侧,而右侧大部分地方都是空白的.当图很宽的时候看着会很不舒服.   可以设置Legends 集合中的Docking ...

  2. 【PMP】项目、项目集、项目组合

    项目:为创建独特的产品和服务成果而进行的临时性工作. 项目集:是一组相互关联且被协调管理的项目.子项目集和项目活动,以便获得分别管理所无法获得的利益. 项目组合:是指实现战略目标而组合在一起管理的项目 ...

  3. Windows批处理 调用程序后 不等待子进程 父进程继续执行命令

    从DOS过来的老鸟应该都知道批处理,这个功能在WINDOWS中仍然保留着.批处理 说白了就是把一系列DOS命令写在一个文本文件里,然后把这个文件命名为XXX.bat(WINXP以后的系统也可以命名为* ...

  4. WinDbg下载符号文件

    设置添加系统环境变量_NT_SYMBOL_PATH 的值为:srv*c:\symbols*http://msdl.microsoft.com/download/symbols 这样启动WinDbg的时 ...

  5. Spring全局异常处理的三种方式

    在J2EE项目的开发中,不管是对底层的数据库操作过程,还是业务层的处理过程,还是控制层的处理过程,都不可避免会遇到各种可预知的.不可预知的异常需要处理.每个过程都单独处理异常,系统的代码耦合度高,工作 ...

  6. C++ 重载运算符和重载函数

    C++ 重载运算符和重载函数 C++ 允许在同一作用域中的某个函数和运算符指定多个定义,分别称为函数重载和运算符重载. 重载声明是指一个与之前已经在该作用域内声明过的函数或方法具有相同名称的声明,但是 ...

  7. 【Tomcat】面向初级 Web 开发人员的 Tomcat

    Apache Tomcat 应用服务器不再是高级 Web 系统开发人员的专用领域.在本教程中,Sing Li 将向初级 Web 开发人员展示如何利用他们当前的 Java™ 开发技能,使用 Tomcat ...

  8. ES6,Array.find()和findIndex()函数的用法

    ES6为Array增加了find(),findIndex函数. find()函数用来查找目标元素,找到就返回该元素,找不到返回undefined. findIndex()函数也是查找目标元素,找到就返 ...

  9. 【iCore3应用】基于iCore3双核心板的编码器应用实例

    简介 本硬件电路方案是针对集电极开路输出的编码器设计的.隔离前电压为5V,同时5V也是编码器的驱动电压,由外部供电:隔离后电压为3.3V,由核心板提供.隔离芯片采用3通道ADUM1300隔离芯片.因为 ...

  10. DBNull与Null的区别

    Null是.net中无效的对象引用. DBNull是一个类.DBNull.Value是它唯一的实例.它指数据库中数据为空(<NULL>)时,在.net中的值. null表示一个对象的指向无 ...