CLI-error
- SQL_ERROR: One of the following occurred:
- RecNumber was negative or 0.
- BufferLength was less than zero.
CLI-error的更多相关文章
- linux 本地套接字通信
本地套接字通信 利用本地套接字,也可以进程间通信. 本地套接字和有名管道一样都利用伪文件 管道的文件类型是p 本地套接字的文件类型是s. 当调用bind函数后,就会生成本地套接字对应的伪装文件 srw ...
- Docker 部署ELK之Sentinl日志报警
前篇文章简单介绍了Docker 部署ELK,以及使用filebeat收集java日志.这篇我们介绍下日志报警配置,这里我们使用Sentinl插件. 1.修改kibana参数 进入elk容器,修改对应参 ...
- php编译安装报错:make: *** [sapi/cli/php] Error 1 解决办法
ext/iconv/.libs/iconv.o: In function `php_iconv_stream_filter_ctor':/ext/iconv/iconv.c:2491: undefin ...
- 安装PHP出现make: *** [sapi/cli/php] Error 1 解决办法
ext/iconv/.libs/iconv.o: In function `php_iconv_stream_filter_ctor':/home/king/php-5.2.13/ext/iconv/ ...
- npm install Error:EPROTO: protocol error, symlink '../mime/cli.js' -> '/vagrant/src/nodejs/node_modules/express/node_modules/send/node_modules/.bin/mime'
我在ubuntu上使用npm安装依赖是出现下面错误: npm ERR! Linux 3.13.0-101-genericnpm ERR! argv "/usr/bin/nodejs" ...
- 重装@angular/cli reason: write EPROTO 139955972261696:error:1408F10B:SSL routines:ssl3_get_record:wrong version number:../deps/openssl/openssl/ssl/record/ssl3_record.c:252:
前几天不小心卸载了 angular@cli,然后重装的时候发现,一直报错.如下: ××××××××@××××ln622653:/$ npm install -g @angular/clinpm ERR ...
- Gulp Error: Cannot find module 'jshint/src/cli'
I'm following sitepoint's An introduction to Gulp.js, but I'm stuck on step four, when I try to run ...
- 转:安装PHP出现make: *** [sapi/cli/php] Error 1 解决办法
ext/iconv/.libs/iconv.o: In function `php_iconv_stream_filter_ctor':/home/king/PHP-5.2.13/ext/iconv/ ...
- 转 安装PHP出现make: *** [sapi/cli/php] Error 1 解决办法
ext/iconv/.libs/iconv.o: In function `php_iconv_stream_filter_ctor':/home/king/php-5.2.13/ext/iconv/ ...
- make: *** [sapi/cli/php] Error 1 解决办法
make: *** [sapi/cli/php] Error 1 一:考虑过make clean,问题依然 二:(采取此方法后出现启动apache报错:/usr/local/apache2/modul ...
随机推荐
- 【Android 应用开发】Android 开发环境下载地址 -- 百度网盘 adt-bundle android-studio sdk adt 下载
19af543b068bdb7f27787c2bc69aba7f Additional Download (32-, 64-bit) Package r10 STL debug info androi ...
- [ES6] 16. Object Enhancements
Define object: var color = "blue"; var speed = 120; var car = {color, speed}; console.log( ...
- xcode 3.x版本中的Executables 到xcode 4.x中怎么找不到了?
转自:http://zhidao.baidu.com/question/327868169.html 1 在Scheme处选择Edit Scheme 2 点击Run(Debug) 3 在Argumen ...
- jquery如何实现domReady和onload判断的
function ready(fn) { var completed = function() { if ( document.addEventListener ) { document.remove ...
- jq实现竞拍倒计时
1jq的效果代码 //全局变量用于存储当前时间 var nows; function rightZeroStr(v) { ) { " + v; } return v + "&quo ...
- Android XML文件布局各个属性详解
第一常用类:属性值为true或false android:layout_centerHrizontal 水平居中 android:layout_centerVertical 垂直居中 android: ...
- 关于 ES6箭头函数
转自 http://simplyy.space/article/577c5b0dcbe0a3e656c87c24 多个连续的箭头函数与柯里化 高阶函数 高阶函数定义:将函数作为参数或者返回值是函 ...
- git workflows
https://www.atlassian.com/git/tutorials/comparing-workflows Comparing Workflows The array of possibl ...
- android源码编译过程
1.下载好android源码包. 2.装好vm,ubuntu(如果能在实体机装linux更好). 3.安装所需要的deb包 在终端执行如下命令: sudo apt-get install flex b ...
- Linux vsftp
本机环境CentOS-6.6-i386-bin-DVD1.iso安装盘.安装时选择minimal模式.本机IP地址配置为192.168.0.211. 1.查询系统是否已安装了vsftpd [root@ ...