mvn 编译异常:Fatal error compiling: 无效的标记: -parameters
错误信息:
[ERROR] Failed to execute goal org.apache.maven.plugins:maven-compiler-plugin::compile (default-compile) on project z-eureka: Fatal error compiling: 无效的标记: -parameters -> [Help]
解决办法:
项目的jdk版本是1.8,但是通过mvn -v查看maven的jdk版本确实1.7,这是问题的关键。调整一下环境变量,使maven的jdk的依赖变成1.8即可。
其实明明我已经修改了环境变量到jdk1.8,但却没有生效,原因可参考我的另一篇文章:https://www.cnblogs.com/chenmingming0225/p/12900711.html
参考文章:https://www.bbsmax.com/A/n2d98WWw5D/
mvn 编译异常:Fatal error compiling: 无效的标记: -parameters的更多相关文章
- Fatal error compiling: 无效的标记: -parameters
[INFO] BUILD FAILURE [INFO] ------------------------------------------------------------------------ ...
- Failed to execute goal org.apache.maven.plugins:maven-compiler-plugin:3.8.1:testCompile (default-testCompile) on project docker_springcloud_demo: Fatal error compiling: 无效的标记: -parameters -> [Help 1]
[ERROR] Failed to execute goal org.apache.maven.plugins:maven-compiler-plugin:3.8.1:testCompile (def ...
- 已解决!Fatal error compiling: 无效的标记(maven启动失败)
问题描述 Fatal error compiling: 无效的标记 maven启动错误..版本号不对 <plugin> <artifactId>maven-compiler-p ...
- maven 编译出错Fatal error compiling: 无效的目标发行版: 1.8 -> [Help 1] 解决办法
这几天在为公司项目搭建一个后台框架,使用的是eclipse-Mars自带的maven插件,在maven进行编译的时候,出现Fatal error compiling: 无效的目标发行版: 1.8 -& ...
- maven 启动 报错 Fatal error compiling: 无效的目标发行版
http://news.tuxi.com.cn/news/119999990123162/31622105.html http://lyking2001.iteye.com/blog/837440 针 ...
- Fatal error compiling: 无效的目标发行版: 1.8 -> [Help 1] (zhuan)
http://blog.csdn.net/z18137017273/article/details/53033613 ***************************************** ...
- maven:Fatal error compiling: 无效的目标发行版: 1.8.0_45 -> [Help 1]
使用mvn clean install命令的时候出现如下的错误: Failed to execute goal org.apache.maven.plugins:maven-compiler-plug ...
- Maven 错误:Failed to execute goal org.apache.maven.plugins:maven-compiler-plugin:3.1:compile (default-compile) on project appservice-common: Fatal error compiling: 无效的目标发行版: 1.8
通过IDEA 提供的面板 执行package 或者 install 没有错误,但是cmd terminal 窗口就不行!出现: Maven 错误:Failed to execute goal org. ...
- maven:Fatal error compiling: 无效的目标 发行版: 1.8 -> [Help 1]
https://blog.csdn.net/kkgbn/article/details/72777750
- Fatal error compiling: invalid target release: 11 -> [Help 1]
<plugin> <groupId>org.apache.maven.plugins</groupId> <artifactId>maven-compi ...
随机推荐
- python 获取android 应用使用情况
python 获取android 应用使用情况 本文主要讲述python 脚本获取android 应用使用情况. 主要思路:使用adb 获取当前activity ,1s 一次输出. 主要涉及知识点: ...
- Javascript Ajax总结——FormData类型
XMLHttpRequest1级只是把已有的XHR对象的实现细节描述出来.XMLHttpRequest2级进一步发展了XHR.FormData类型FormData类型,为序列化表单以及创建以表单格式相 ...
- ASR项目实战-交付团队的分工
对于通常的软件项目,参与角色,比如可以有用户,消费者,产品团队,研发团队(研发团队包括开发和测试),运营团队,运维团队,管理团队. 通常认为,用户,负责购买服务的群体,而消费者,负责使用业务的群体.这 ...
- Python中的协程、线程和进程
一.协程与多线程和多进程一起使用有什么不同 协程.多线程和多进程都是实现程序并发执行的方法,不过它们在工作方式和适合的应用场景上存在一些区别. 1.协程(Coroutine) 协程是在单一线程 ...
- Ubuntu 之 7zip使用
1.安装 sudo apt-get install p7zip 2.压缩 7zr a xxx foldername 3.解压缩 7zr x xxx.7z 4.zip命令压缩文件夹 zip -qr xx ...
- 通过腾讯网页快捷登录协议截取 QQ邮箱 的 QQClientkey / QQKey 教程
最近发现之前的老代码已经不能获取QQ邮箱的Clientkey,经过一番调试后发现QQ邮箱更新了获取的流程,所以决定重新发布一篇文章,废话不多,直接上教程,喜欢的朋友记得点赞加关注. step 1 首先 ...
- CSS 基础 4 - CSS 常用单位
CSS 基础 4 - CSS 常用单位 px:基础单位 em:相对当前父容器的系数,可以累乘 rem:相对根 <html> 的系数,方便计算 vw/vh:viewport width/he ...
- maven系列:多环境配置与应用
目录 一.多环境配置步骤 定义多环境 使用多环境(构建过程) 二.跳过测试(了解) 应用场景 跳过测试命令 2.3 细粒度控制跳过测试 多环境配置有什么好处? maven提供配置多种环境的设定,帮助开 ...
- Cesium中用到的图形技术——Horizon Culling
译者注:本文翻译自Cesium官方博文<Horizon Culling>,by KEVIN RING. 目录 地平线针对球体剔除一个点 平面测试 圆锥测试 推广到椭球 代码 预览 在开发像 ...
- ChatGPT新玩法来了,微信聊天机器人
前言 上一篇文章中说了ChatGPT是什么,然后怎么注册使用. 传送门:花了1块钱体验一把最近很火的ChatGPT 但是实际操作下来还是有不少小伙伴跟我一样遇到各种坑. 没有魔法工具 OpenAI的服 ...