Keil4 每次选build 编译(F7)都全部编译的解决办法 http://blog.csdn.net/wchengshen/article/details/50440079 Keil4 每次选build 编译(F7)都全部编译的解决办法: ocean 验证: project--option for target 'xxx' ---target---Code Generation-- 将Use Cross-Module Optimization勾选去掉 再多重新编译一次就可以了.…
[转]Ubuntu 上编译Android出现cannot find -lstdc++解决办法 在Ubuntu 12.04 x86_64机器上编译Android出现下面错误,是因为找不到32bit的libstdc++.so库. /usr/bin/ld: skipping incompatible /usr/lib/gcc/x86_64-linux-gnu/4.6/libstdc++.so when searching for -lstdc++ /usr/bin/ld: skipping incom…
不多说,直接上干货! 这个问题,跟 全网最详细的Hadoop HA集群启动后,两个namenode都是standby的解决办法(图文详解) 是大同小异. 欢迎大家,加入我的微信公众号:大数据躺过的坑        人工智能躺过的坑       同时,大家可以关注我的个人博客:    http://www.cnblogs.com/zlslch/   和     http://www.cnblogs.com/lchzls/      http://www.cnblogs.com/sunnyDream…
参考:Hadoop集群所有的DataNode都启动不了解决办法说明现象:我自己出现这个问题的原因是:自己在namenode格式化之后创建了一些文件,然后重新执行了namenode格式化导致的. 现象就是./sbin/start-dfs.sh 之后,通过jps查看master的namenode.secondnamenode启动成功,但是slave节点上面的datanode没有启动 导致这问题的原因: 就是在两次格式化期间,主从节点的文件系统HDFS中的文件不一致,删除从节点上的hdfs初始目录下的…
/** * date:2016/8/17 * author: Y.X .YANG */ 按照开发文档提示: 1.MTK提供的开发包目录下有若干个.aa .ab .ac ...的分压缩包.此时应当将这些压缩包并包,使用以下命令: # cat MT8127_M0_MP8_0407_t8370_emmc.tar.gz* >> MT8127_M0_MP8_0407_t8370_emmc.tar.gz 2.对 MT8127_M0_MP8_0407_t8370_emmc.tar.gz 进行解包.使用以下命…
Error message:   [html] view plaincopy execution not covered by lifecycle configuration: org.apache.maven.plugins:maven-jar-plugin:2.3.1:jar (execution: default-jar, phase: process-classes) 多个子项目的pom.xml文件在eclipse下都有叉叉, 上面是error msg. 查阅网上资料, eclipse…
源链接:http://www.tangqizhong.info/?p=741 myget(至今不明白为什么它对应的命令是mytget…)是我从用linux之后就开一直在用的命令行下载工具(其次也会用到axel,wget),但直到某天发现运行mytget报错,没办法,估计是更新系统后,一些库发生变化了.没办法,只好再编译一遍.在编译的时候报错了,解决的办法如下:utils.cpp: 在函数‘int determine_screen_width()’中:utils.cpp:128:18: 错误:‘s…
不多说,直接上干货! 解决办法 因为,如下,我的Hadoop HA集群. 1.首先在hdfs-site.xml中添加下面的参数,该参数的值默认为false: <property> <name>dfs.ha.automatic-failover.enabled.ns</name> <value>true</value> </property> 2.在core-site.xml文件中添加下面的参数,该参数的值为ZooKeeper服务器的地…
编译Chromium时出现 warning C4819: The file contains a character that cannot be represented in the current code page (949). Save the file in Unicode format to prevent data loss 这个警告其实不影响文件内容以及正常编译的,但是由于chromium的编译设置严格,默认将警告视为错误,所以出现这个警告时会视为错误导致编译终止.解决办法: 将…
1.首先排除网上说的 安装的WIN7是精简版的问题,我这个是旗舰版,以前是正常安装IIS的,后来程序问题我卸载了,就安装不上了 2.网上说的修改什么UAC权限,也是胡扯,因为默认都是最低的 3.排除网上说的非管理员权限,这点知识刚毕业的都知道是不是管理员登陆吧. 最终的解决办法是: 先用命令卸载iis  .net 4.0 第一步:cd  C:\Windows\Microsoft.NET\Framework\v4.0.30319    然后 aspnet_regiis.exe -u 第二步:用正常…
转载自:http://git.oschina.net/oschina/git-osc/issues/2586   作者:Zoker https方式每次都要输入密码,按照如下设置即可输入一次就不用再手输入密码的困扰而且又享受https带来的极速 设置记住密码(默认15分钟): git config --global credential.helper cache 如果想自己设置时间,可以这样做: git config credential.helper 'cache --timeout=3600'…
Windows XP,每次开机都自动检测硬盘,之前正常关机,没有任何非法操作.Windows XP,每次开机都自动检测硬盘,之前正常关机,没有任何非法操作. 1.和硬盘的分区格式有关,FAT32格式在非法关机后会在开机时要求检测硬盘,而且必须检测完毕才不会在下次启动时重新检测.系统有一个文件中记录了检测是否结束的信息,有时即使检测完成了也会因为这个文件没有更新而在下次开机时重新检测. 2.硬盘出现坏道. 解决: 方法一: 如果分区是FAT32格式,将其转换成NTFS,方法是在命令提示符下输入:c…
1.在VS2015解决方案管理器中删除掉ALL_BUILD和ZERO_CHECK项,只保留Cmake生成的工程文件. 2.进行第一部之后还是有可能生成(build)失败,此时有可能是缺少文件.…
问题描述: 用STS(类似于Eclipse)正在开发一个JavaWeb项目,但不知怎么的有一天,修改完Java代码,点击运行Tomcat,发现根本没有修改.刚刚开始的时候,因为一开始没找到原因而且工期赶得紧,并没有立马解决.使用了另外一种比较麻烦的界面办法,就是Project-->Clean ….这样子,虽然能解决暂时不能部署上去的问题,但是相当麻烦,每次Clean的时间长不说,而且每次都进行这步操作,感觉整个人生都失去了光彩~ Eclipse中Clean的作用: 将工程中的.class文件删除…
1."std::ios_base::Init::~Init()", referenced from 出现这样的编译问题,是需要再加进libstdc++.dylib和libstdc++.6.dylib(为6.1使用,xcode5以后默认complier也可以编译通过) 2.apple Mach-o Linker error通常是因为compile source中有相同的.m文件 3.如果在真机中进行测试时出现failed to get the task for process,有可能是证…
说明在android studio中没有 build tools 的26.0.2的版本,你确认一下,是否是这样: 点击==>android studio的菜单栏中Tools==>android==>SDK Manager==> 然后在 第一行的Tools中 ,看一下是不是26.0.2显示not install,如果是的话,点击,然后 install 即可:…
CLANG备忘录: 1.编译时遇到 LINK1123 错误尝试使用其他版本的VS编译,可以有效解决这个问题 2.编译时遇到 Unexpectedfailure executing llvm-build: 错误为python版本太高,python 2.x版本可以解决所有问题…
ArcGIS10.2下VS2010的AddIn,在10.3下在VS2012下重新编译出现missing ESRI ArcGIS Add-in SDK错误,导致无法生成esriAddIn安装文件. 该问题由于ESRI对VS2010和VS2012中SDK命名不一致造成的BUG. VS2010的工程文件中为ESRI.ArcGIS.AddIns.targets VS2012的工程文件中为ESRI.ArcGIS.AddIns.11.targets 解决方法1: 更改工程文件中相关命名 解决方法2:简单 直…
https://cmake.org/download/win10的同学注意了按右键以管理员模式启动cmake-gui.exe在Where is the source code:里填上你解压的CEF3路径,如:E:\cef\cef_binary_3.2623.1401.gb90a3be_windows32在Where to build the binaries里填上你要输入项目文件的位置,如:E:\cef\cef_binary_3.2623.1401.gb90a3be_windows32再点击Co…
1.   configure: error: xslt-config not found. Please reinstall the libxslt >= 1.1.0 distribution 复制代码 代码如下: yum -y install libxslt-devel 2.   configure: error: Could not find net-snmp-config binary. Please check your net-snmp installation. 复制代码 代码如下:…
1.  vc++ 的编译器的错误往往定位在错误的那一处,但是那一处可能在库的底层,而我们知道库,一般都不会错. 这时候应该好好看看我们自己的头文件是否正确,有可能头文件中的一些错误引发了连锁反应. 2. 头文件不要忘了写 std::vector 而写成了 vector…
nunicodeessscape codec can't decode bytes in position2-3:truncated\UXXXXXXXX escape 描述:im=Image.open("C:\Users\Administrator\Desktop\mylove.jpg") 解决方法: im=Image.open(r"C:\Users\Administrator\Desktop\mylove.jpg") TypeError: 'int' object…
1.configure: error: No curses/termcap library found yum -y install ncurses-devel 2.configure: error: xml2-config not found. Please check your libxml2 installation. yum -y install libxml2 libxml2-devel 3.configure: error: Cannot find OpenSSL’s yum -y…
一般是安装包丢失或损坏,那么我么可以用离线下载的方式来先行下载. 用 -h 看下帮助 主要是Layout参数. 下载完,到下载目录安装吧.…
https://stackoverflow.com/questions/42932577/error-cs1056-unexpected-character-running-the-msbuild-on-a-tfs-continuous-i/43005149…
$(function () { var cpLock = true; $('#textbox').off().on({ compositionstart: function () {//中文输入开始 cpLock = false; }, compositionend: function () {//中文输入结束 cpLock = true; }, input: function () {//input框中的值发生变化 if (cpLock) this.value = this.value.rep…
首先必须降低gcc版本: sudo apt-get install gcc-4.4sudo apt-get install g++-4.4sudo rm -rf /usr/bin/gcc /usr/bin/g++sudo ln -s /usr/bin/gcc-4.4 /usr/bin/gccsudo ln -s /usr/bin/g++-4.4 /usr/bin/g++     ################ Fix 1 ########################## Error: fr…
2013年07月10日 14:47:27 阅读数:1239 错误: /usr/include/gnu/stubs.h:7:27: error: gnu/stubs-32.h: No such file or directory make: *** [out/host/linux-x86/obj/EXECUTABLES/acp_intermediates/acp.o] 错误 1 解决: sudo apt-get install libc6-dev-i386 错误: make: *** [out/h…
1. 编译时出现/usr/bin/ld: skipping incompatible /usr/lib/gcc/x86_64-linux-gnu/4.4.5/../../../libz.so when searching for -lz PLATFORM_VERSION_CODENAME=AOSPPLATFORM_VERSION=AOSPTARGET_PRODUCT=genericTARGET_BUILD_VARIANT=engTARGET_SIMULATOR=TARGET_BUILD_TYPE…
1.软件版本 Git版本:Git-1.9.0-preview20140217.exe TortoiseGit:TortoiseGit-1.8.8.0-64bit.msi     2.出现问题 使用右键TortoiseGit clone代码时,发现不能load私钥文件,”Load Putty Key”的勾选框是灰色的.   3.解决办法 在TortoiseGit的Settings中找到Network,在下面的SSH client设置为TortoisePlink.exe,该文件在TortoiseGi…