Execution default-resources of goal org.apache.maven.plugins:maven-resources-plugin:2.6:resources failed: Unable to load the mojo 'resources' (or one of its required components)
1、异常提示: Description Resource Path Location Type
Execution default-resources of goal org.apache.maven.plugins:maven-resources-plugin:2.6:resources failed: Unable to load the mojo 'resources' (or one of its required components) from the plugin 'org.apache.maven.plugins:maven-resources-plugin:2.6' (org.apache.maven.plugins:maven-resources-plugin:2.6:resources:default-resources:process-resources) org.apache.maven.plugin.PluginExecutionException: Execution default-resources of goal org.apache.maven.plugins:maven-resources-plugin:2.6:resources failed: Unable to load the mojo 'resources' (or one of its required components) from the plugin 'org.apache.maven.plugins:maven-resources-plugin:2.6'
at org.apache.maven.plugin.DefaultBuildPluginManager.executeMojo(DefaultBuildPluginManager.java:153)
at org.eclipse.m2e.core.internal.embedder.MavenImpl.execute(MavenImpl.java:331)
at org.eclipse.m2e.core.internal.embedder.MavenImpl$11.call(MavenImpl.java:1362)
at org.eclipse.m2e.core.internal.embedder.MavenImpl$11.call(MavenImpl.java:1)
at org.eclipse.m2e.core.internal.embedder.MavenExecutionContext.executeBare(MavenExecutionContext.java:176)
at org.eclipse.m2e.core.internal.embedder.MavenExecutionContext.execute(MavenExecutionContext.java:112)
at org.eclipse.m2e.core.internal.embedder.MavenImpl.execute(MavenImpl.java:1360)
at org.eclipse.m2e.core.project.configurator.MojoExecutionBuildParticipant.build(MojoExecutionBuildParticipant.java:52)
at org.eclipse.m2e.core.internal.builder.MavenBuilderImpl.build(MavenBuilderImpl.java:137)
at org.eclipse.m2e.core.internal.builder.MavenBuilder$1.method(MavenBuilder.java:172)
at org.eclipse.m2e.core.internal.builder.MavenBuilder$1.method(MavenBuilder.java:1)
at org.eclipse.m2e.core.internal.builder.MavenBuilder$BuildMethod$1$1.call(MavenBuilder.java:115)
at org.eclipse.m2e.core.internal.embedder.MavenExecutionContext.executeBare(MavenExecutionContext.java:176)
at org.eclipse.m2e.core.internal.embedder.MavenExecutionContext.execute(MavenExecutionContext.java:112)
at org.eclipse.m2e.core.internal.builder.MavenBuilder$BuildMethod$1.call(MavenBuilder.java:105)
at org.eclipse.m2e.core.internal.embedder.MavenExecutionContext.executeBare(MavenExecutionContext.java:176)
at org.eclipse.m2e.core.internal.embedder.MavenExecutionContext.execute(MavenExecutionContext.java:151)
at org.eclipse.m2e.core.internal.embedder.MavenExecutionContext.execute(MavenExecutionContext.java:99)
at org.eclipse.m2e.core.internal.builder.MavenBuilder$BuildMethod.execute(MavenBuilder.java:86)
at org.eclipse.m2e.core.internal.builder.MavenBuilder.build(MavenBuilder.java:200)
at org.eclipse.core.internal.events.BuildManager$2.run(BuildManager.java:735)
at org.eclipse.core.runtime.SafeRunner.run(SafeRunner.java:42)
at org.eclipse.core.internal.events.BuildManager.basicBuild(BuildManager.java:206)
at org.eclipse.core.internal.events.BuildManager.basicBuild(BuildManager.java:246)
at org.eclipse.core.internal.events.BuildManager$1.run(BuildManager.java:301)
at org.eclipse.core.runtime.SafeRunner.run(SafeRunner.java:42)
at org.eclipse.core.internal.events.BuildManager.basicBuild(BuildManager.java:304)
at org.eclipse.core.internal.events.BuildManager.basicBuildLoop(BuildManager.java:360)
at org.eclipse.core.internal.events.BuildManager.build(BuildManager.java:383)
at org.eclipse.core.internal.events.AutoBuildJob.doBuild(AutoBuildJob.java:144)
at org.eclipse.core.internal.events.AutoBuildJob.run(AutoBuildJob.java:235)
at org.eclipse.core.internal.jobs.Worker.run(Worker.java:55)
Caused by: org.apache.maven.plugin.PluginContainerException: Unable to load the mojo 'resources' (or one of its required components) from the plugin 'org.apache.maven.plugins:maven-resources-plugin:2.6'
at org.apache.maven.plugin.internal.DefaultMavenPluginManager.getConfiguredMojo(DefaultMavenPluginManager.java:551)
at org.apache.maven.plugin.DefaultBuildPluginManager.executeMojo(DefaultBuildPluginManager.java:121)
... 31 more
Caused by: org.codehaus.plexus.component.repository.exception.ComponentLookupException: java.util.NoSuchElementException
role: org.apache.maven.plugin.Mojo
roleHint: org.apache.maven.plugins:maven-resources-plugin:2.6:resources
at org.codehaus.plexus.DefaultPlexusContainer.lookup(DefaultPlexusContainer.java:267)
at org.codehaus.plexus.DefaultPlexusContainer.lookup(DefaultPlexusContainer.java:255)
at org.apache.maven.plugin.internal.DefaultMavenPluginManager.getConfiguredMojo(DefaultMavenPluginManager.java:517)
... 32 more
Caused by: java.util.NoSuchElementException
at org.eclipse.sisu.plexus.RealmFilteredBeans$FilteredItr.next(RealmFilteredBeans.java:118)
at org.eclipse.sisu.plexus.RealmFilteredBeans$FilteredItr.next(RealmFilteredBeans.java:1)
at org.eclipse.sisu.plexus.DefaultPlexusBeans$Itr.next(DefaultPlexusBeans.java:76)
at org.eclipse.sisu.plexus.DefaultPlexusBeans$Itr.next(DefaultPlexusBeans.java:1)
at org.codehaus.plexus.DefaultPlexusContainer.lookup(DefaultPlexusContainer.java:263)
... 34 more
pom.xml /artup-common2 line 53 Maven Build Problem 2、原因:从 Execution default-resources of goal org.apache.maven.plugins:maven-resources-plugin:2.6:resources failed: Unable to load the mojo 'resources' (or one of its required components) from the plugin 'org.apache.maven.plugins:maven-resources-plugin:2.6' (org.apache.maven.plugins:maven-resources-plugin:2.6:resources:default-resources:process-resources) 我们可以看到是 maven 没有能够加载 maven-resources-plugin 这个插件。 3、解决办法:在 pom.xml 中加入 maven-resources-plugin 插件,版本根据自己的情况定,这里的版本是 2.6。
Execution default-resources of goal org.apache.maven.plugins:maven-resources-plugin:2.6:resources failed: Unable to load the mojo 'resources' (or one of its required components)的更多相关文章
- Failed to execute goal org.apache.maven.plugins:maven-clean-plugin:2.5:clean (default-
Maven项目报错:Failed to execute goal org.apache.maven.plugins:maven-clean-plugin:2.5:clean (default-clea ...
- Failed to execute goal org.apache.maven.plugins:maven-surefire-plugin:2.22.1:test (default-test) on project sharp-common: Execution default-test of goal org.apache.maven.plugins:maven-surefire-plugin
[INFO] Scanning for projects... [INFO] [INFO] -----------------------< com.sharp:sharp-common > ...
- Failed to execute goal org.apache.maven.plugins:maven-resources-plugin:3.0.2:resources 在我的myeclipse中新建maven工程总出现这个问题
只需在下图中更改代码 更改后是这样的: <plugin> <groupId>org.apache.maven.plugins</groupId> <artif ...
- 使用idea maven打包项目 Failed to execute goal org.apache.maven.plugins:maven-resources-plugin:3.0.2:resources
超级折磨人 在网上搜到的解决方案: 技术交流群 : 816227112 修改 和 <plugin> <groupId>org.apache.maven.plugins</ ...
- Maven进行install的时候报错,COMPILATION ERROR : Failed to execute goal org.apache.maven.plugins:maven-surefire-plugin:2.13:test (default-test) on project cmu: There are test failures.
maven进行install的时候,test类里面报错: COMPILATION ERROR : [INFO] -------------------------------------------- ...
- [ERROR] Failed to execute goal org.apache.maven.plugins:maven-install-plugin:2.3.1:
security-sdk-1.0.jar已经存在于D:/secServerSDK-test/src/main/resources/lib下 报错如下: xxxxxx@xxxxxxxx /d/secSe ...
- Execution default of goal org.springframework.boot:spring-boot-maven-plugin:1.5.6.RELEASE:repackage failed: Unable to find main class
异常 [INFO] --- spring-boot-maven-plugin:1.5.6.RELEASE:repackage (default) @ spring-boot-starter-log - ...
- Failed to execute goal org.apache.maven.plugins:maven-compiler-plugin:3.1:compile 解决办法
Maven install失败 Failed to execute goal org.apache.maven.plugins:maven-compiler-plugin:3.1:compile (d ...
- maven build时报错Failed to execute goal org.apache.maven.plugins:maven-surefire-plugin:2.12.4:test
[INFO] BUILD FAILURE [INFO] ------------------------------------------------------------------------ ...
随机推荐
- Bootrap 项目实战(微金所前端首页)第一部分
微金所前端首页成果图:(这是本人自己按照微金所官网首页,采用Bootrap,JS,JQuery,css制作的网页效果图,在第二部分我会公布网页源代码) 如需网页源代码,请在下方留言,备注你的qq邮箱. ...
- HTML DOM--基础概述
DOM: Document Object Model(文档对象模型)的简写,那么,这是一种什么样的模型,简单点来说,就是将文档当成了一棵树.它独立于平台与语言,允许程序与脚本动态地访问.更新文档的结构 ...
- [原创] Laravel 启动流程
目录 1. 程序启动准备 1.1 容器基础配置 1.2 核心类绑定 1.3 实例化 Http 核心类 2. 请求实例化 3. 请求处理 3.1 请求处理环境初始化 1. 环境监测 \Illuminat ...
- 大数据平台-java、mysql安装
补充: 对于ssh登录不是特定端口22的,进行文件修改 vim /etc/ssh/sshd_config Port 61333 简化后序命令输入,修改文件如下: 一.java环境安装 一共5台服务器 ...
- [转] Ansible 系列之 Playbooks 剧本
[From] https://www.cnblogs.com/hanyifeng/p/6435875.html 一.Playbooks 介绍 1.Playbooks是Ansible的配置,部署和编排语 ...
- tess4j 注意事项
依赖: <dependency> <groupId>net.sourceforge.tess4j</groupId> <artifactId>tess4 ...
- activeMQ入门+spring boot整合activeMQ
最近想要学习MOM(消息中间件:Message Oriented Middleware),就从比较基础的activeMQ学起,rabbitMQ.zeroMQ.rocketMQ.Kafka等后续再去学习 ...
- mysql并发更新问题
问题背景: 假设MySQL数据库有一张会员表vip_member(InnoDB表),结构如下: 当一个会员想续买会员(只能续买1个月.3个月或6个月)时,必须满足以下业务要求: •如果end_at ...
- sed常用命令
sed也是一个管道命令. sed [-nefr] [动作] -n 加上-n参数后,只有经过sed特殊处理的那些行才会被列出来 -e 直接在命令行模式进行sed的动作编辑 -i 直接修改读取的文件内容 ...
- BNU44583——Star Trek: First Contact——————【01背包】
H. Star Trek: First Contact Time Limit: 1000ms Memory Limit: 65536KB 64-bit integer IO format: %lld ...