maven build时报错Failed to execute goal org.apache.maven.plugins:maven-surefire-plugin:2.12.4:test
[INFO] BUILD FAILURE
[INFO] ------------------------------------------------------------------------
[INFO] Total time: 3.319 s
[INFO] Finished at: --24T10::+:
[INFO] Final Memory: 16M/205M
[INFO] ------------------------------------------------------------------------
[ERROR] Failed to execute goal org.apache.maven.plugins:maven-surefire-plugin:2.12.:test (default-test) on project base-util: Execution default-test of goal org.apache.maven.plugins:maven-surefire-plugin:2.12.:test failed: Plugin org.apache.maven.plugins:maven-surefire-plugin:2.12. or one of its dependencies could not be resolved: Failure to find org.apache.maven.surefire:maven-surefire-common:jar:2.12. in http://192.168.16.91/nexus/content/groups/public/ was cached in the local repository, resolution will not be reattempted until the update interval of user-releases has elapsed or updates are forced -> [Help 1]
org.apache.maven.lifecycle.LifecycleExecutionException: Failed to execute goal org.apache.maven.plugins:maven-surefire-plugin:2.12.:test (default-test) on project zhiyuan-base-util: Execution default-test of goal org.apache.maven.plugins:maven-surefire-plugin:2.12.:test failed: Plugin org.apache.maven.plugins:maven-surefire-plugin:2.12. or one of its dependencies could not be resolved: Failure to find org.apache.maven.surefire:maven-surefire-common:jar:2.12. in http://192.168.16.91/nexus/content/groups/public/ was cached in the local repository, resolution will not be reattempted until the update interval of user-releases has elapsed or updates are forced
at org.apache.maven.lifecycle.internal.MojoExecutor.execute(MojoExecutor.java:)
at org.apache.maven.lifecycle.internal.MojoExecutor.execute(MojoExecutor.java:)
at org.apache.maven.lifecycle.internal.MojoExecutor.execute(MojoExecutor.java:)
at org.apache.maven.lifecycle.internal.LifecycleModuleBuilder.buildProject(LifecycleModuleBuilder.java:)
at org.apache.maven.lifecycle.internal.LifecycleModuleBuilder.buildProject(LifecycleModuleBuilder.java:)
at org.apache.maven.lifecycle.internal.builder.singlethreaded.SingleThreadedBuilder.build(SingleThreadedBuilder.java:)
at org.apache.maven.lifecycle.internal.LifecycleStarter.execute(LifecycleStarter.java:)
at org.apache.maven.DefaultMaven.doExecute(DefaultMaven.java:)
at org.apache.maven.DefaultMaven.execute(DefaultMaven.java:)
at org.apache.maven.cli.MavenCli.execute(MavenCli.java:)
at org.apache.maven.cli.MavenCli.doMain(MavenCli.java:)
at org.apache.maven.cli.MavenCli.main(MavenCli.java:)
at sun.reflect.NativeMethodAccessorImpl.invoke0(Native Method)
at sun.reflect.NativeMethodAccessorImpl.invoke(NativeMethodAccessorImpl.java:)
at sun.reflect.DelegatingMethodAccessorImpl.invoke(DelegatingMethodAccessorImpl.java:)
at java.lang.reflect.Method.invoke(Method.java:)
at org.codehaus.plexus.classworlds.launcher.Launcher.launchEnhanced(Launcher.java:)
at org.codehaus.plexus.classworlds.launcher.Launcher.launch(Launcher.java:)
at org.codehaus.plexus.classworlds.launcher.Launcher.mainWithExitCode(Launcher.java:)
at org.codehaus.plexus.classworlds.launcher.Launcher.main(Launcher.java:)
Caused by: org.apache.maven.plugin.PluginExecutionException: Execution default-test of goal org.apache.maven.plugins:maven-surefire-plugin:2.12.:test failed: Plugin org.apache.maven.plugins:maven-surefire-plugin:2.12. or one of its dependencies could not be resolved: Failure to find org.apache.maven.surefire:maven-surefire-common:jar:2.12. in http://192.168.16.91/nexus/content/groups/public/ was cached in the local repository, resolution will not be reattempted until the update interval of user-releases has elapsed or updates are forced
at org.apache.maven.plugin.DefaultBuildPluginManager.executeMojo(DefaultBuildPluginManager.java:)
at org.apache.maven.lifecycle.internal.MojoExecutor.execute(MojoExecutor.java:)
... more
Caused by: org.apache.maven.plugin.PluginResolutionException: Plugin org.apache.maven.plugins:maven-surefire-plugin:2.12. or one of its dependencies could not be resolved: Failure to find org.apache.maven.surefire:maven-surefire-common:jar:2.12. in http://192.168.16.91/nexus/content/groups/public/ was cached in the local repository, resolution will not be reattempted until the update interval of user-releases has elapsed or updates are forced
at org.apache.maven.plugin.internal.DefaultPluginDependenciesResolver.resolve(DefaultPluginDependenciesResolver.java:)
at org.apache.maven.plugin.internal.DefaultMavenPluginManager.createPluginRealm(DefaultMavenPluginManager.java:)
at org.apache.maven.plugin.internal.DefaultMavenPluginManager.setupPluginRealm(DefaultMavenPluginManager.java:)
at org.apache.maven.plugin.DefaultBuildPluginManager.getPluginRealm(DefaultBuildPluginManager.java:)
at org.apache.maven.plugin.DefaultBuildPluginManager.executeMojo(DefaultBuildPluginManager.java:)
... more
Caused by: org.eclipse.aether.resolution.ArtifactResolutionException: Failure to find org.apache.maven.surefire:maven-surefire-common:jar:2.12. in http://192.168.16.91:8080/nexus/content/groups/public/ was cached in the local repository, resolution will not be reattempted until the update interval of user-releases has elapsed or updates are forced
at org.eclipse.aether.internal.impl.DefaultArtifactResolver.resolve(DefaultArtifactResolver.java:)
at org.eclipse.aether.internal.impl.DefaultArtifactResolver.resolveArtifacts(DefaultArtifactResolver.java:)
at org.eclipse.aether.internal.impl.DefaultRepositorySystem.resolveDependencies(DefaultRepositorySystem.java:)
at org.apache.maven.plugin.internal.DefaultPluginDependenciesResolver.resolve(DefaultPluginDependenciesResolver.java:)
... more
Caused by: org.eclipse.aether.transfer.ArtifactNotFoundException: Failure to find org.apache.maven.surefire:maven-surefire-common:jar:2.12. in http://192.168.16.91/nexus/content/groups/public/ was cached in the local repository, resolution will not be reattempted until the update interval of user-releases has elapsed or updates are forced
at org.eclipse.aether.internal.impl.DefaultUpdateCheckManager.newException(DefaultUpdateCheckManager.java:)
at org.eclipse.aether.internal.impl.DefaultUpdateCheckManager.checkArtifact(DefaultUpdateCheckManager.java:)
at org.eclipse.aether.internal.impl.DefaultArtifactResolver.gatherDownloads(DefaultArtifactResolver.java:)
at org.eclipse.aether.internal.impl.DefaultArtifactResolver.performDownloads(DefaultArtifactResolver.java:)
at org.eclipse.aether.internal.impl.DefaultArtifactResolver.resolve(DefaultArtifactResolver.java:)
... more
[ERROR]
[ERROR] Re-run Maven using the -X switch to enable full debug logging.
[ERROR]
[ERROR] For more information about the errors and possible solutions, please read the following articles:
[ERROR] [Help ] http://cwiki.apache.org/confluence/display/MAVEN/PluginResolutionException
可能原因有很多个,
1. maven私服连不上了, 有一些jar包没有下载到本地, 或者是私服的路径配置错误
<distributionManagement>
<repository>
<id>user-releases</id>
<name>Nexus Release Repository</name>
<url>http://192.168.16.91/nexus/content/repositories/releases/</url>
</repository>
<snapshotRepository>
<id>user-snapshots</id>
<name>Nexus Snapshot Repository</name>
<url>http://192.168.16.91/nexus/content/repositories/snapshots/</url>
</snapshotRepository>
</distributionManagement>
配置可以参考上面这段, url链接要在地址栏里面能打开才算正确
还有可能是一个jar包下载失败, jar包坏了, 可以删掉本地的repository, 执行maven->update project...重新下载jar到本地仓库
2. .classpath配置文件错误
在项目上右键->properties->java build path->source->删掉里面的src/main/java和src/test/java配置, 然后点右侧的add folder重新添加
3. 测试类里面报错, 导致无法build
可以删掉测试类, 重新尝试构建
4. 如果以上三个都无法解决这个问题, 那就删工作空间吧, 干掉workspace!!
如需帮助可向我发起QQ聊天发起QQ聊天
友情赞助
如果您喜欢此文,感觉对您工作有帮助,预期领导会给您涨工资,不妨小额赞助一下,让我有动力继续努力。
赞助方式:打开支付宝App,使用“扫一扫”付款,付款码见下图,别忘了付款留言哦!

或使用微信, 不用加好友就能付款
maven build时报错Failed to execute goal org.apache.maven.plugins:maven-surefire-plugin:2.12.4:test的更多相关文章
- maven install时报错 Failed to execute goal org.apache.maven.plugins:maven-surefire-plugin:2.12.4:test (default-test)
今天在一个maven项目上执行maven install命令的时候一直报错,错误信息如下: [INFO] ----------------------------------------------- ...
- maven install时报错Failed to execute goal org.apache.maven.plugins:maven-compiler-plugin:2.3.2:compile
首先检查父项目,子项目的jdk版本是否一致,编码格式是否一致我的问题就错在了编码格式上,父项目用的是UTF-8,子项目新建的,默认GBK这时,使用maven install命令出错 提示:[INFO] ...
- maven install时报错Failed to execute goal org.apache.maven.plugins:maven-surefire-plugin:2.12.4:test
事故现场: 解决办法: 一是命令行, mvn clean package -Dmaven.test.skip=true 二是写入pom文件, <plugin> <groupId> ...
- 启动Maven项目时报错Failed to execute goal org.apache.maven.plugins:maven-clean-plugin:2.5:clean (default-clean) on project **-web: Failed to clean project: Failed to delete E:\**\target\tomcat\logs\access_lo
这类错误 出现这种错误,通常是由于您已启动了另一个tomcat 进程或者运行的javaw.exe进程,导致报错. 解决方法: 1. 鼠标点击 X 进行关闭运行失败的 Console页,(如果运行多次, ...
- 在IDEA上 使用maven进行打包时报错: Failed to execute goal org.apache.maven.plugins:maven-javadoc-plugin:2.10.2:jar
报错内容: Failed to execute goal org.apache.maven.plugins:maven-javadoc-plugin:2.10.2:jar (attach-javado ...
- git 打包报错:Maven Build时提示:Failed to execute goal org.apache.maven.plugins:maven-surefire-plugin:2.12.4:test
1.使用git 升级 服务命令 mvn deploy -e 之后报错: Failed to execute goal org.apache.maven.plugins:maven-surefire- ...
- maven install 报错Failed to execute goal org.apache.maven.plugins:maven-compiler-plugin:3.1:compile (default-compile) on project*****
[ERROR]Failed to execute goal org.apache.maven.plugins:maven-compiler-plugin:3.1:compile (default-co ...
- SpringBoot MAVEN编译报错Failed to execute goal org.apache.maven.plugins:maven-compiler-plugin:3.8.0:
参考了好几篇文章没搞定,直到查询错误关键字 An unknown compilation problem occurred 分别参考了以下博客: https://blog.csdn.net/fanre ...
- maven install 报错 Failed to execute goal org.apache.maven.plugins:maven-surefire-plugin:2.12.4:test
pom文件引入以下依赖 <plugin> <groupId>org.apache.maven.plugins</groupId> <artifactId> ...
随机推荐
- Machine Learning 思维导图
Feature Enigneering 经用 sns.distplot 测试 一个Series 做 StandardScaler().fit_transform(Seriese) 之前和之后的图形形状 ...
- 【1】学习C++时,一些零散知识点01
1.编程理念 学习从学习完C后,接触了C++,最重要的便是编程理念的转变.C缩重视的是结构化编程,面对一个较大的程序,就将他分解成小型.便于管理的任务,如果分解后的任务还是偏难过大的话,那将这个任务继 ...
- verdi\debussy的使用技巧
verdi\debussy的使用技巧 转载from 大西瓜FPGA 大西瓜FPGA-->https://daxiguafpga.taobao.com fsdb display Debussy本身 ...
- # 20175333曹雅坤《Java程序设计》第2周学习总结
教材学习内容总结 1.学习第二,三章ppt,并观看视频. 2.在虚拟机中连接到码云,克隆代码,编译与运行教材上的例子. 3.在虚拟机上安装相关配置,使其满足学习要求. 4.运行并截图上传监督学习脚本s ...
- FF D8 FF FE 00 24 47 00转图片
String[] img = "FF D8 FF FE 00 24 47 00 9D 0C 00 00 00 00 00 00 00 00 00 00 00 00 00 00 00 F0 0 ...
- pyspider
Linux系统我使用CentOS.对于pycurl安装问题比较好解决,只需要先安装对应的开发包即可.执行如下命令: yum install python-devel curl-devel 分别安装py ...
- P1250 种树
P1250 种树 题目描述 一条街的一边有几座房子.因为环保原因居民想要在路边种些树.路边的地区被分割成块,并被编号成1..N.每个部分为一个单位尺寸大小并最多可种一棵树.每个居民想在门前种些树并指定 ...
- 微服务杂谈--EureKa及自我保护
时值初夏,各位老官的心也有所悸动,这不,众看官搬好小板凳,沏一壶清茶,待听Jerry话谈Eureka,以此静心.话不多少,且听: 一.微服务的产生 单体应用:一个jar或者一个war包交给运维,运行在 ...
- Scyther spdl(比较准确的翻译)
1.协议的主要的核心是定义一个协议在协议中声明角色: Protocol ExampleProtocol(I,R){ role I{ }; role R{ }://在角色中一开始我们没有定义角 ...
- 出错: IOException parsing XML document from ServletContext resource [/cn.mgy.conig]; nested exception is java.io.FileNotFoundException: Could not open ServletContext resource [/cn.mgy.conig]
错误的详细内容: 严重: StandardWrapper.Throwable org.springframework.beans.factory.BeanDefinitionStoreExceptio ...