报错内容:

Failed to execute goal org.apache.maven.plugins:maven-javadoc-plugin:2.10.2:jar (attach-javadocs) on project SLXFWZ: MavenReportException: Error while creating archive:

Exit code: 1 - ����: δ֪��ö�ٳ��� FieldFill.INSERT

ԭ��: �Ҳ���com.baomidou.mybatisplus.annotation.FieldFill�����ļ�

����: δ֪��ö�ٳ��� JdbcType.VARCHAR

ԭ��: �Ҳ���org.apache.ibatis.type.JdbcType�����ļ�

����: δ֪��ö�ٳ��� FieldFill.INSERT

����: δ֪��ö�ٳ��� JdbcType.VARCHAR

����: δ֪��ö�ٳ��� FieldFill.INSERT

����: δ֪��ö�ٳ��� JdbcType.VARCHAR

����: δ֪��ö�ٳ��� FieldFill.UPDATE

����: δ֪��ö�ٳ��� JdbcType.VARCHAR

����: δ֪��ö�ٳ��� FieldFill.UPDATE

����: δ֪��ö�ٳ��� JdbcType.VARCHAR

����: δ֪��ö�ٳ��� FieldFill.UPDATE

����: δ֪��ö�ٳ��� JdbcType.VARCHAR

java.lang.IllegalArgumentException

at sun.net.www.ParseUtil.decode(ParseUtil.java:202)

at sun.misc.URLClassPath$FileLoader.<init>(URLClassPath.java:1293)

at sun.misc.URLClassPath$3.run(URLClassPath.java:570)

at sun.misc.URLClassPath$3.run(URLClassPath.java:565)

at java.security.AccessController.doPrivileged(Native Method)

at sun.misc.URLClassPath.getLoader(URLClassPath.java:564)

at sun.misc.URLClassPath.getLoader(URLClassPath.java:529)

at sun.misc.URLClassPath.getNextLoader(URLClassPath.java:494)

at sun.misc.URLClassPath.access$100(URLClassPath.java:66)

at sun.misc.URLClassPath$1.next(URLClassPath.java:276)

at sun.misc.URLClassPath$1.hasMoreElements(URLClassPath.java:287)

at java.net.URLClassLoader$3$1.run(URLClassLoader.java:604)

at java.net.URLClassLoader$3$1.run(URLClassLoader.java:602)

at java.security.AccessController.doPrivileged(Native Method)

at java.net.URLClassLoader$3.next(URLClassLoader.java:601)

at java.net.URLClassLoader$3.hasMoreElements(URLClassLoader.java:626)

at sun.misc.CompoundEnumeration.next(CompoundEnumeration.java:45)

at sun.misc.CompoundEnumeration.hasMoreElements(CompoundEnumeration.java:54)

at java.util.ServiceLoader$LazyIterator.hasNextService(ServiceLoader.java:354)

at java.util.ServiceLoader$LazyIterator.hasNext(ServiceLoader.java:393)

at java.util.ServiceLoader$1.hasNext(ServiceLoader.java:474)

at javax.xml.parsers.FactoryFinder$1.run(FactoryFinder.java:293)

at java.security.AccessController.doPrivileged(Native Method)

at javax.xml.parsers.FactoryFinder.findServiceProvider(FactoryFinder.java:289)

at javax.xml.parsers.FactoryFinder.find(FactoryFinder.java:267)

at javax.xml.parsers.SAXParserFactory.newInstance(SAXParserFactory.java:127)

at com.sun.tools.doclets.internal.toolkit.builders.LayoutParser.parseXML(LayoutParser.java:89)

at com.sun.tools.doclets.internal.toolkit.builders.ClassBuilder.build(ClassBuilder.java:120)

at com.sun.tools.doclets.formats.html.HtmlDoclet.generateClassFiles(HtmlDoclet.java:189)

at com.sun.tools.doclets.internal.toolkit.AbstractDoclet.generateClassFiles(AbstractDoclet.java:194)

at com.sun.tools.doclets.internal.toolkit.AbstractDoclet.startGeneration(AbstractDoclet.java:139)

at com.sun.tools.doclets.internal.toolkit.AbstractDoclet.start(AbstractDoclet.java:82)

at com.sun.tools.doclets.formats.html.HtmlDoclet.start(HtmlDoclet.java:80)

at com.sun.tools.doclets.standard.Standard.start(Standard.java:39)

at sun.reflect.NativeMethodAccessorImpl.invoke0(Native Method)

at sun.reflect.NativeMethodAccessorImpl.invoke(NativeMethodAccessorImpl.java:62)

at sun.reflect.DelegatingMethodAccessorImpl.invoke(DelegatingMethodAccessorImpl.java:43)

at java.lang.reflect.Method.invoke(Method.java:498)

at com.sun.tools.javadoc.DocletInvoker.invoke(DocletInvoker.java:310)

at com.sun.tools.javadoc.DocletInvoker.start(DocletInvoker.java:189)

at com.sun.tools.javadoc.Start.parseAndExecute(Start.java:366)

at com.sun.tools.javadoc.Start.begin(Start.java:219)

at com.sun.tools.javadoc.Start.begin(Start.java:205)

at com.sun.tools.javadoc.Main.execute(Main.java:64)

at com.sun.tools.javadoc.Main.main(Main.java:54)

javadoc: ���� - java.lang.IllegalArgumentException

Command line was: E:\javajdk\jdk1.8.0_211\jre\..\bin\javadoc.exe @options @packages

Refer to the generated Javadoc files in 'K:\XMDM-ALL-XXXXXXXX\SLXF\SLXFWZ\target\apidocs' dir.


解决方案:

在使用mvn package进行编译、打包时,Maven会执行src/test/java中的JUnit测试用例,有时为了跳过测试,会使用参数-DskipTests和-Dmaven.test.skip=true,这两个参数的主要区别是:

-DskipTests,不执行测试用例,但编译测试用例类生成相应的class文件至target/test-classes下。

-Dmaven.test.skip=true,不执行测试用例,也不编译测试用例类。

使用下面命令执行:

mvn clean install  -DskipTests  -Dmaven.javadoc.skip=true

在IDEA上 使用maven进行打包时报错: Failed to execute goal org.apache.maven.plugins:maven-javadoc-plugin:2.10.2:jar的更多相关文章

  1. maven build时报错Failed to execute goal org.apache.maven.plugins:maven-surefire-plugin:2.12.4:test

    [INFO] BUILD FAILURE [INFO] ------------------------------------------------------------------------ ...

  2. maven install时报错 Failed to execute goal org.apache.maven.plugins:maven-surefire-plugin:2.12.4:test (default-test)

    今天在一个maven项目上执行maven install命令的时候一直报错,错误信息如下: [INFO] ----------------------------------------------- ...

  3. Maven 项目打包出现错误 Failed to execute goal org.apache.maven.plugins:maven-resources-plugin

    今天碰到一个奇怪的问题,就是我在eclipse中使用maven命令:clean package 命令打完包之后,通过FlashFXP将jar包上传到Linux服务器后,由于其他原因,我想要修改下程序重 ...

  4. maven install时报错Failed to execute goal org.apache.maven.plugins:maven-compiler-plugin:2.3.2:compile

    首先检查父项目,子项目的jdk版本是否一致,编码格式是否一致我的问题就错在了编码格式上,父项目用的是UTF-8,子项目新建的,默认GBK这时,使用maven install命令出错 提示:[INFO] ...

  5. maven install时报错Failed to execute goal org.apache.maven.plugins:maven-surefire-plugin:2.12.4:test

    事故现场: 解决办法: 一是命令行, mvn clean package -Dmaven.test.skip=true 二是写入pom文件, <plugin> <groupId> ...

  6. 启动Maven项目时报错Failed to execute goal org.apache.maven.plugins:maven-clean-plugin:2.5:clean (default-clean) on project **-web: Failed to clean project: Failed to delete E:\**\target\tomcat\logs\access_lo

    这类错误 出现这种错误,通常是由于您已启动了另一个tomcat 进程或者运行的javaw.exe进程,导致报错. 解决方法: 1. 鼠标点击 X 进行关闭运行失败的 Console页,(如果运行多次, ...

  7. 打包遇到错误Failed to execute goal org.apache.maven.plugins:maven-surefire-plugin:2.22.2:test

    引自:https://blog.csdn.net/xiexiangyan/article/details/107936774 遇到的问题 有一个maven项目,我clone一下最新的代码.准备打包(m ...

  8. maven install 报错Failed to execute goal org.apache.maven.plugins:maven-compiler-plugin:3.1:compile (default-compile) on project*****

    [ERROR]Failed to execute goal org.apache.maven.plugins:maven-compiler-plugin:3.1:compile (default-co ...

  9. mvn install 报错Failed to execute goal org.apache.maven.plugins:maven-compiler-plugin:2.3.2 错误: 找不到符号

    报错信息 在Eclipse中执行mvn install时,console端显示如下报错信息: [ERROR] Failed to execute goal org.apache.maven.plugi ...

随机推荐

  1. malloc/free与new/delete的区别(转)

    相同点:都可用于申请动态内存和释放内存 不同点:(1)操作对象有所不同.malloc与free是C++/C 语言的标准库函数,new/delete 是C++的运算符.对于非内部数据类的对象而言,光用m ...

  2. 测试:OGG初始化同步表,源端抽取进程scn<源端事务的start_scn时,这个变化是否会同步到目标库中?

    一.测试目标 疑问,OGG初始化同步表,源端抽取进程开始抽取的scn<源端事务的start_scn时,这个变化是否会同步到目标库中? 二.实验测试 如下进行测试! session 1 SQL&g ...

  3. Mon失效处理方法

    假设环境为三个mon,主机名为mon1.mon2.mon3,现在mon3上面的系统盘损坏,mon的数据完全丢失,现在需要对mon3进行恢复处理 1.停止所有mon进程,可以不停其他进程,需要停止内核客 ...

  4. Python_异常处理、调试

    1.try except 机制 # 错误处理 # 一般程序都要用到错误捕获,当没有加且有错误的时候Python解释器会执行错误捕获,且是一层层向上捕获[所以问题点会在最下面] try: print(' ...

  5. LeetCode-Python-删除链表解题思路

    给定一个链表,删除链表的倒数第 n 个节点,并且返回链表的头结点.   image.png 解题思路: 使用双指针,快指针与慢指针的间隔为n: 涉及到最后要删除慢指针的节点,为了方便,先开辟一个nod ...

  6. 【干货!!】十分钟带你搞懂 Java AQS 核心设计与实现!!!

    前言 这篇文章写完放着也蛮久的了,今天终于发布了,对于拖延症患者来说也真是不容易-哈哈哈. 言归正传,其实吧..我觉得对于大部分想了解 AQS 的朋友来说,明白 AQS 是个啥玩意儿以及为啥需要 AQ ...

  7. day01-网络基础

    一.知识点 1.socket.socket 创建一个 socket,该函数带有两个参数: Address Family:可以选择 AF_INET(用于 Internet 进程间通信) 或者 AF_UN ...

  8. sqlilab less32-less37

    less-32 过滤了单引号,双引号,斜杠,同时设置数据库为GBK编码,可以考虑宽字节注入, 当设置gbk编码后,遇到连续两个字节,都符合gbk取值范围,会自动解析为一个汉字.用脚本来测试下哪些符合 ...

  9. rkhunter

    0 0 * * 0 /usr/local/bin/rkhunter -c --cronjob 定时工具

  10. Vue最简单的实现网页Live2D看板娘

    Live2D看板娘 前言 二.使用步骤 1.引入 2.设置样式 结尾(后续更新更强的配置看板娘~) 前言 最近想给自己的网页添点新花样,然后就想到了别人的网站都有一些看板娘的玩意儿,看着很舒服,鉴于自 ...