事故现场:

解决办法:

一是命令行,

mvn clean package -Dmaven.test.skip=true

去项目所在文件夹与pom文件同级执行命令

二是写入pom文件,注意父子级节点结构

.....
<build>
  <plugins>
    <plugin>
<groupId>org.apache.maven.plugins</groupId>
<artifactId>maven-surefire-plugin</artifactId>
<version>2.4.2</version>
<configuration>
<skipTests>true</skipTests>
</configuration>
</plugin> </plugins>
</build>
.....

maven install时报错Failed to execute goal org.apache.maven.plugins:maven-surefire-plugin:2.12.4:test的更多相关文章

  1. maven install时报错 Failed to execute goal org.apache.maven.plugins:maven-surefire-plugin:2.12.4:test (default-test)

    今天在一个maven项目上执行maven install命令的时候一直报错,错误信息如下: [INFO] ----------------------------------------------- ...

  2. maven install时报错Failed to execute goal org.apache.maven.plugins:maven-compiler-plugin:2.3.2:compile

    首先检查父项目,子项目的jdk版本是否一致,编码格式是否一致我的问题就错在了编码格式上,父项目用的是UTF-8,子项目新建的,默认GBK这时,使用maven install命令出错 提示:[INFO] ...

  3. maven build时报错Failed to execute goal org.apache.maven.plugins:maven-surefire-plugin:2.12.4:test

    [INFO] BUILD FAILURE [INFO] ------------------------------------------------------------------------ ...

  4. maven install 报错Failed to execute goal org.apache.maven.plugins:maven-compiler-plugin:3.1:compile (default-compile) on project*****

    [ERROR]Failed to execute goal org.apache.maven.plugins:maven-compiler-plugin:3.1:compile (default-co ...

  5. 启动Maven项目时报错Failed to execute goal org.apache.maven.plugins:maven-clean-plugin:2.5:clean (default-clean) on project **-web: Failed to clean project: Failed to delete E:\**\target\tomcat\logs\access_lo

    这类错误 出现这种错误,通常是由于您已启动了另一个tomcat 进程或者运行的javaw.exe进程,导致报错. 解决方法: 1. 鼠标点击 X 进行关闭运行失败的 Console页,(如果运行多次, ...

  6. maven install 报错 Failed to execute goal org.apache.maven.plugins:maven-surefire-plugin:2.12.4:test

    pom文件引入以下依赖 <plugin> <groupId>org.apache.maven.plugins</groupId> <artifactId> ...

  7. mvn install 报错Failed to execute goal org.apache.maven.plugins:maven-compiler-plugin:2.3.2 错误: 找不到符号

    报错信息 在Eclipse中执行mvn install时,console端显示如下报错信息: [ERROR] Failed to execute goal org.apache.maven.plugi ...

  8. 在IDEA上 使用maven进行打包时报错: Failed to execute goal org.apache.maven.plugins:maven-javadoc-plugin:2.10.2:jar

    报错内容: Failed to execute goal org.apache.maven.plugins:maven-javadoc-plugin:2.10.2:jar (attach-javado ...

  9. 解决maven项目 maven install失败 错误 Failed to execute goal org.apache.maven.plugins

    1.Maven构建失败 Failed to execute goal org.apache.maven.plugins:maven-compiler-plugin: 2.3.4 :compile ( ...

随机推荐

  1. sonarQube安装及本机扫描C#项目

    因项目需要,需要使用sonarQube对代码进行扫描并查看,因对sonarQube不熟悉,所以先在本机搭建测试环境. 参考了张老师的博客:http://www.cnblogs.com/danzhang ...

  2. VS2015运行 cordova 时候提示无法运行解决

    出现此问题的原因是在于npm程序损坏了.vs调用的npm程序并不是在node安装目录下的npm,而是在: C:\Users\用户名\AppData\Roaming\Microsoft\VisualSt ...

  3. NBUT 1223 Friends number

    暴力,打表. 计算出每一个数的因子之和,可以枚举$i$,让后将$i$的倍数都加上$i$.发现这样的只有$71$对,然后暴力就可以了. #include<cstdio> #include&l ...

  4. HDU 4865 Peter's Hobby

    $dp$. 这题的本质和求一个有向无环图的最长路径长度的路径是一样的. $dp[i][j]$表示到第$i$天,湿度为$a[i]$,是第$j$种天气的最大概率.记录一下最大概率是$i-1$天哪一种天气推 ...

  5. oracle 查看16进制

    DUMP function is useful for this purpose. SQL> select dump(C1) from test; DUMP(C1)--------------- ...

  6. [CF600E]Dsu on tree

    题意:树上每个点都有颜色,称一个颜色占领一棵子树,当且仅当没有别的颜色在这棵子树内的数量比它多.求所有子树的占领颜色之和.题解:最显然的是DFS序+主席树或莫队,这里使用Dsu on tree. 每次 ...

  7. 【深度搜索+剪枝】POJ1011-Sticks

    深搜部分和之前的POJ2362差不多,只是有几处需要额外的剪枝. [思路]排序后从最短木棒开始搜索至木棒长总和,如果木棒长总和sum能整除当前棒长,则进入深搜. [剪枝]先前POJ2362的剪枝部分不 ...

  8. Perl正则表达式

    perl正则表达式就是通过一串特别设计的字符串,可以按照我们的需求匹配.替换.转化目标字符串.本文主要是对一些常用的正则表达以及语法的总结以及举例,供广大喜爱Perl的同学交流学习. 操作符: =~ ...

  9. Java本地方法(native方法)的实现

    Java不是完美的,Java的不足除了体现在运行速度上要比传统的C++慢许多之外,Java无法直接访问到操作系统底层(如系统硬件等),为此Java使用native方法来扩展Java程序的功能. 可以将 ...

  10. 统计个位数的数目 Exercise07_07

    /** * @author 冰樱梦 * 时间:2018年下半年 * 题目:统计个位数的数目 * */ public class Exercise07_07 { public static void m ...